zookeeper-dev mailing list archives

Site index · List index
Message view « Date » · « Thread »
Top « Date » · « Thread »
From Apache Jenkins Server <jenk...@builds.apache.org>
Subject Build failed in Jenkins: zookeeper-master-maven-owasp #70
Date Thu, 01 Aug 2019 06:26:45 GMT
See <https://builds.apache.org/job/zookeeper-master-maven-owasp/70/display/redirect?page=changes>

Changes:

[eolivelli] ZOOKEEPER-3430: Observability improvement: provide top N read / write

[eolivelli] ZOOKEEPER-3418: Improve quorum throughput through eager ACL checks of

------------------------------------------
[...truncated 14.81 KB...]
    at java.util.concurrent.ThreadPoolExecutor$Worker.run (ThreadPoolExecutor.java:624)
    at java.lang.Thread.run (Thread.java:748)
Caused by: org.owasp.dependencycheck.utils.DownloadFailedException: Download failed, unable
to retrieve 'https://nvd.nist.gov/feeds/json/cve/1.0/nvdcve-1.0-modified.meta'
    at org.owasp.dependencycheck.utils.Downloader.fetchContent (Downloader.java:115)
    at org.owasp.dependencycheck.data.update.NvdCveUpdater.getMetaFile (NvdCveUpdater.java:352)
    at org.owasp.dependencycheck.data.update.NvdCveUpdater.getUpdatesNeeded (NvdCveUpdater.java:401)
    at org.owasp.dependencycheck.data.update.NvdCveUpdater.update (NvdCveUpdater.java:121)
    at org.owasp.dependencycheck.Engine.doUpdates (Engine.java:915)
    at org.owasp.dependencycheck.Engine.initializeAndUpdateDatabase (Engine.java:717)
    at org.owasp.dependencycheck.Engine.analyzeDependencies (Engine.java:652)
    at org.owasp.dependencycheck.maven.BaseDependencyCheckMojo.runCheck (BaseDependencyCheckMojo.java:1388)
    at org.owasp.dependencycheck.maven.BaseDependencyCheckMojo.execute (BaseDependencyCheckMojo.java:789)
    at org.apache.maven.plugin.DefaultBuildPluginManager.executeMojo (DefaultBuildPluginManager.java:137)
    at org.apache.maven.lifecycle.internal.MojoExecutor.execute (MojoExecutor.java:210)
    at org.apache.maven.lifecycle.internal.MojoExecutor.execute (MojoExecutor.java:156)
    at org.apache.maven.lifecycle.internal.MojoExecutor.execute (MojoExecutor.java:148)
    at org.apache.maven.lifecycle.internal.LifecycleModuleBuilder.buildProject (LifecycleModuleBuilder.java:117)
    at org.apache.maven.lifecycle.internal.LifecycleModuleBuilder.buildProject (LifecycleModuleBuilder.java:81)
    at org.apache.maven.lifecycle.internal.builder.singlethreaded.SingleThreadedBuilder.build
(SingleThreadedBuilder.java:56)
    at org.apache.maven.lifecycle.internal.LifecycleStarter.execute (LifecycleStarter.java:128)
    at org.apache.maven.DefaultMaven.doExecute (DefaultMaven.java:305)
    at org.apache.maven.DefaultMaven.doExecute (DefaultMaven.java:192)
    at org.apache.maven.DefaultMaven.execute (DefaultMaven.java:105)
    at org.jvnet.hudson.maven3.launcher.Maven35Launcher.main (Maven35Launcher.java:130)
    at sun.reflect.NativeMethodAccessorImpl.invoke0 (Native Method)
    at sun.reflect.NativeMethodAccessorImpl.invoke (NativeMethodAccessorImpl.java:62)
    at sun.reflect.DelegatingMethodAccessorImpl.invoke (DelegatingMethodAccessorImpl.java:43)
    at java.lang.reflect.Method.invoke (Method.java:498)
    at org.codehaus.plexus.classworlds.launcher.Launcher.launchEnhanced (Launcher.java:289)
    at org.codehaus.plexus.classworlds.launcher.Launcher.launch (Launcher.java:229)
    at jenkins.maven3.agent.Maven35Main.launch (Maven35Main.java:176)
    at sun.reflect.NativeMethodAccessorImpl.invoke0 (Native Method)
    at sun.reflect.NativeMethodAccessorImpl.invoke (NativeMethodAccessorImpl.java:62)
    at sun.reflect.DelegatingMethodAccessorImpl.invoke (DelegatingMethodAccessorImpl.java:43)
    at java.lang.reflect.Method.invoke (Method.java:498)
    at hudson.maven.Maven3Builder.call (Maven3Builder.java:139)
    at hudson.maven.Maven3Builder.call (Maven3Builder.java:70)
    at hudson.remoting.UserRequest.perform (UserRequest.java:212)
    at hudson.remoting.UserRequest.perform (UserRequest.java:54)
    at hudson.remoting.Request$2.run (Request.java:369)
    at hudson.remoting.InterceptingExecutorService$1.call (InterceptingExecutorService.java:72)
    at java.util.concurrent.FutureTask.run (FutureTask.java:266)
    at java.util.concurrent.ThreadPoolExecutor.runWorker (ThreadPoolExecutor.java:1149)
    at java.util.concurrent.ThreadPoolExecutor$Worker.run (ThreadPoolExecutor.java:624)
    at java.lang.Thread.run (Thread.java:748)
Caused by: org.owasp.dependencycheck.utils.DownloadFailedException: Error downloading file
https://nvd.nist.gov/feeds/json/cve/1.0/nvdcve-1.0-modified.meta; unable to connect.
    at org.owasp.dependencycheck.utils.HttpResourceConnection.obtainConnection (HttpResourceConnection.java:238)
    at org.owasp.dependencycheck.utils.HttpResourceConnection.fetch (HttpResourceConnection.java:138)
    at org.owasp.dependencycheck.utils.Downloader.fetchContent (Downloader.java:110)
    at org.owasp.dependencycheck.data.update.NvdCveUpdater.getMetaFile (NvdCveUpdater.java:352)
    at org.owasp.dependencycheck.data.update.NvdCveUpdater.getUpdatesNeeded (NvdCveUpdater.java:401)
    at org.owasp.dependencycheck.data.update.NvdCveUpdater.update (NvdCveUpdater.java:121)
    at org.owasp.dependencycheck.Engine.doUpdates (Engine.java:915)
    at org.owasp.dependencycheck.Engine.initializeAndUpdateDatabase (Engine.java:717)
    at org.owasp.dependencycheck.Engine.analyzeDependencies (Engine.java:652)
    at org.owasp.dependencycheck.maven.BaseDependencyCheckMojo.runCheck (BaseDependencyCheckMojo.java:1388)
    at org.owasp.dependencycheck.maven.BaseDependencyCheckMojo.execute (BaseDependencyCheckMojo.java:789)
    at org.apache.maven.plugin.DefaultBuildPluginManager.executeMojo (DefaultBuildPluginManager.java:137)
    at org.apache.maven.lifecycle.internal.MojoExecutor.execute (MojoExecutor.java:210)
    at org.apache.maven.lifecycle.internal.MojoExecutor.execute (MojoExecutor.java:156)
    at org.apache.maven.lifecycle.internal.MojoExecutor.execute (MojoExecutor.java:148)
    at org.apache.maven.lifecycle.internal.LifecycleModuleBuilder.buildProject (LifecycleModuleBuilder.java:117)
    at org.apache.maven.lifecycle.internal.LifecycleModuleBuilder.buildProject (LifecycleModuleBuilder.java:81)
    at org.apache.maven.lifecycle.internal.builder.singlethreaded.SingleThreadedBuilder.build
(SingleThreadedBuilder.java:56)
    at org.apache.maven.lifecycle.internal.LifecycleStarter.execute (LifecycleStarter.java:128)
    at org.apache.maven.DefaultMaven.doExecute (DefaultMaven.java:305)
    at org.apache.maven.DefaultMaven.doExecute (DefaultMaven.java:192)
    at org.apache.maven.DefaultMaven.execute (DefaultMaven.java:105)
    at org.jvnet.hudson.maven3.launcher.Maven35Launcher.main (Maven35Launcher.java:130)
    at sun.reflect.NativeMethodAccessorImpl.invoke0 (Native Method)
    at sun.reflect.NativeMethodAccessorImpl.invoke (NativeMethodAccessorImpl.java:62)
    at sun.reflect.DelegatingMethodAccessorImpl.invoke (DelegatingMethodAccessorImpl.java:43)
    at java.lang.reflect.Method.invoke (Method.java:498)
    at org.codehaus.plexus.classworlds.launcher.Launcher.launchEnhanced (Launcher.java:289)
    at org.codehaus.plexus.classworlds.launcher.Launcher.launch (Launcher.java:229)
    at jenkins.maven3.agent.Maven35Main.launch (Maven35Main.java:176)
    at sun.reflect.NativeMethodAccessorImpl.invoke0 (Native Method)
    at sun.reflect.NativeMethodAccessorImpl.invoke (NativeMethodAccessorImpl.java:62)
    at sun.reflect.DelegatingMethodAccessorImpl.invoke (DelegatingMethodAccessorImpl.java:43)
    at java.lang.reflect.Method.invoke (Method.java:498)
    at hudson.maven.Maven3Builder.call (Maven3Builder.java:139)
    at hudson.maven.Maven3Builder.call (Maven3Builder.java:70)
    at hudson.remoting.UserRequest.perform (UserRequest.java:212)
    at hudson.remoting.UserRequest.perform (UserRequest.java:54)
    at hudson.remoting.Request$2.run (Request.java:369)
    at hudson.remoting.InterceptingExecutorService$1.call (InterceptingExecutorService.java:72)
    at java.util.concurrent.FutureTask.run (FutureTask.java:266)
    at java.util.concurrent.ThreadPoolExecutor.runWorker (ThreadPoolExecutor.java:1149)
    at java.util.concurrent.ThreadPoolExecutor$Worker.run (ThreadPoolExecutor.java:624)
    at java.lang.Thread.run (Thread.java:748)
Caused by: java.net.UnknownHostException: nvd.nist.gov
    at java.net.AbstractPlainSocketImpl.connect (AbstractPlainSocketImpl.java:184)
    at java.net.SocksSocketImpl.connect (SocksSocketImpl.java:392)
    at java.net.Socket.connect (Socket.java:589)
    at sun.net.NetworkClient.doConnect (NetworkClient.java:175)
    at sun.net.www.http.HttpClient.openServer (HttpClient.java:463)
    at sun.net.www.http.HttpClient.openServer (HttpClient.java:558)
    at sun.net.www.protocol.https.HttpsClient.<init> (HttpsClient.java:264)
    at sun.net.www.protocol.https.HttpsClient.New (HttpsClient.java:367)
    at sun.net.www.protocol.https.AbstractDelegateHttpsURLConnection.getNewHttpClient (AbstractDelegateHttpsURLConnection.java:191)
    at sun.net.www.protocol.http.HttpURLConnection.plainConnect0 (HttpURLConnection.java:1156)
    at sun.net.www.protocol.http.HttpURLConnection.plainConnect (HttpURLConnection.java:1050)
    at sun.net.www.protocol.https.AbstractDelegateHttpsURLConnection.connect (AbstractDelegateHttpsURLConnection.java:177)
    at sun.net.www.protocol.https.HttpsURLConnectionImpl.connect (HttpsURLConnectionImpl.java:162)
    at org.owasp.dependencycheck.utils.HttpResourceConnection.obtainConnection (HttpResourceConnection.java:178)
    at org.owasp.dependencycheck.utils.HttpResourceConnection.fetch (HttpResourceConnection.java:138)
    at org.owasp.dependencycheck.utils.Downloader.fetchContent (Downloader.java:110)
    at org.owasp.dependencycheck.data.update.NvdCveUpdater.getMetaFile (NvdCveUpdater.java:352)
    at org.owasp.dependencycheck.data.update.NvdCveUpdater.getUpdatesNeeded (NvdCveUpdater.java:401)
    at org.owasp.dependencycheck.data.update.NvdCveUpdater.update (NvdCveUpdater.java:121)
    at org.owasp.dependencycheck.Engine.doUpdates (Engine.java:915)
    at org.owasp.dependencycheck.Engine.initializeAndUpdateDatabase (Engine.java:717)
    at org.owasp.dependencycheck.Engine.analyzeDependencies (Engine.java:652)
    at org.owasp.dependencycheck.maven.BaseDependencyCheckMojo.runCheck (BaseDependencyCheckMojo.java:1388)
    at org.owasp.dependencycheck.maven.BaseDependencyCheckMojo.execute (BaseDependencyCheckMojo.java:789)
    at org.apache.maven.plugin.DefaultBuildPluginManager.executeMojo (DefaultBuildPluginManager.java:137)
    at org.apache.maven.lifecycle.internal.MojoExecutor.execute (MojoExecutor.java:210)
    at org.apache.maven.lifecycle.internal.MojoExecutor.execute (MojoExecutor.java:156)
    at org.apache.maven.lifecycle.internal.MojoExecutor.execute (MojoExecutor.java:148)
    at org.apache.maven.lifecycle.internal.LifecycleModuleBuilder.buildProject (LifecycleModuleBuilder.java:117)
    at org.apache.maven.lifecycle.internal.LifecycleModuleBuilder.buildProject (LifecycleModuleBuilder.java:81)
    at org.apache.maven.lifecycle.internal.builder.singlethreaded.SingleThreadedBuilder.build
(SingleThreadedBuilder.java:56)
    at org.apache.maven.lifecycle.internal.LifecycleStarter.execute (LifecycleStarter.java:128)
    at org.apache.maven.DefaultMaven.doExecute (DefaultMaven.java:305)
    at org.apache.maven.DefaultMaven.doExecute (DefaultMaven.java:192)
    at org.apache.maven.DefaultMaven.execute (DefaultMaven.java:105)
    at org.jvnet.hudson.maven3.launcher.Maven35Launcher.main (Maven35Launcher.java:130)
    at sun.reflect.NativeMethodAccessorImpl.invoke0 (Native Method)
    at sun.reflect.NativeMethodAccessorImpl.invoke (NativeMethodAccessorImpl.java:62)
    at sun.reflect.DelegatingMethodAccessorImpl.invoke (DelegatingMethodAccessorImpl.java:43)
    at java.lang.reflect.Method.invoke (Method.java:498)
    at org.codehaus.plexus.classworlds.launcher.Launcher.launchEnhanced (Launcher.java:289)
    at org.codehaus.plexus.classworlds.launcher.Launcher.launch (Launcher.java:229)
    at jenkins.maven3.agent.Maven35Main.launch (Maven35Main.java:176)
    at sun.reflect.NativeMethodAccessorImpl.invoke0 (Native Method)
    at sun.reflect.NativeMethodAccessorImpl.invoke (NativeMethodAccessorImpl.java:62)
    at sun.reflect.DelegatingMethodAccessorImpl.invoke (DelegatingMethodAccessorImpl.java:43)
    at java.lang.reflect.Method.invoke (Method.java:498)
    at hudson.maven.Maven3Builder.call (Maven3Builder.java:139)
    at hudson.maven.Maven3Builder.call (Maven3Builder.java:70)
    at hudson.remoting.UserRequest.perform (UserRequest.java:212)
    at hudson.remoting.UserRequest.perform (UserRequest.java:54)
    at hudson.remoting.Request$2.run (Request.java:369)
    at hudson.remoting.InterceptingExecutorService$1.call (InterceptingExecutorService.java:72)
    at java.util.concurrent.FutureTask.run (FutureTask.java:266)
    at java.util.concurrent.ThreadPoolExecutor.runWorker (ThreadPoolExecutor.java:1149)
    at java.util.concurrent.ThreadPoolExecutor$Worker.run (ThreadPoolExecutor.java:624)
    at java.lang.Thread.run (Thread.java:748)
[INFO] Skipping RetireJS update since last update was within 24 hours.
[WARNING] Unable to update 1 or more Cached Web DataSource, using local data instead. Results
may not include recent vulnerabilities.
[ERROR] Unable to continue dependency-check analysis.
[INFO] Element event queue destroyed: org.apache.commons.jcs.engine.control.event.ElementEventQueue@191c557e
[INFO] In DISPOSE, [NODEAUDIT] fromRemote [false]
[INFO] In DISPOSE, [NODEAUDIT] auxiliary [NODEAUDIT]
[INFO] In DISPOSE, [NODEAUDIT] put 0 into auxiliary NODEAUDIT
[INFO] No longer waiting for event queue to finish: Pooled Cache Event Queue
Working = true
Alive = false
Empty = true
Queue Size = 0
Queue Capacity = 2147483647
Pool Size = 0
Maximum Pool Size = 150
[INFO] In dispose, destroying event queue.
[INFO] Region [NODEAUDIT] Saving keys to: NODEAUDIT, key count: 0
[INFO] Region [NODEAUDIT] Finished saving keys.
[INFO] Region [NODEAUDIT] Shutdown complete.
[INFO] In DISPOSE, [NODEAUDIT] disposing of memory cache.
[INFO] Memory Cache dispose called.
[INFO] In DISPOSE, [CENTRAL] fromRemote [false]
[INFO] In DISPOSE, [CENTRAL] auxiliary [CENTRAL]
[INFO] In DISPOSE, [CENTRAL] put 0 into auxiliary CENTRAL
[INFO] No longer waiting for event queue to finish: Pooled Cache Event Queue
Working = true
Alive = false
Empty = true
Queue Size = 0
Queue Capacity = 2147483647
Pool Size = 0
Maximum Pool Size = 150
[INFO] In dispose, destroying event queue.
[INFO] Region [CENTRAL] Saving keys to: CENTRAL, key count: 0
[INFO] Region [CENTRAL] Finished saving keys.
[INFO] Region [CENTRAL] Shutdown complete.
[INFO] In DISPOSE, [CENTRAL] disposing of memory cache.
[INFO] Memory Cache dispose called.
[INFO] In DISPOSE, [POM] fromRemote [false]
[INFO] In DISPOSE, [POM] auxiliary [POM]
[INFO] In DISPOSE, [POM] put 0 into auxiliary POM
[INFO] No longer waiting for event queue to finish: Pooled Cache Event Queue
Working = true
Alive = false
Empty = true
Queue Size = 0
Queue Capacity = 2147483647
Pool Size = 0
Maximum Pool Size = 150
[INFO] In dispose, destroying event queue.
[INFO] Region [POM] Saving keys to: POM, key count: 0
[INFO] Region [POM] Finished saving keys.
[INFO] Region [POM] Shutdown complete.
[INFO] In DISPOSE, [POM] disposing of memory cache.
[INFO] Memory Cache dispose called.
[INFO] ------------------------------------------------------------------------
[INFO] Reactor Summary for Apache ZooKeeper 3.6.0-SNAPSHOT:
[INFO] 
[INFO] Apache ZooKeeper ................................... FAILURE [ 15.897 s]
[INFO] Apache ZooKeeper - Documentation ................... SKIPPED
[INFO] Apache ZooKeeper - Jute ............................ SKIPPED
[INFO] Apache ZooKeeper - Server .......................... SKIPPED
[INFO] Apache ZooKeeper - Metrics Providers ............... SKIPPED
[INFO] Apache ZooKeeper - Prometheus.io Metrics Provider .. SKIPPED
[INFO] Apache ZooKeeper - Client .......................... SKIPPED
[INFO] Apache ZooKeeper - Recipes ......................... SKIPPED
[INFO] Apache ZooKeeper - Recipes - Election .............. SKIPPED
[INFO] Apache ZooKeeper - Recipes - Lock .................. SKIPPED
[INFO] Apache ZooKeeper - Recipes - Queue ................. SKIPPED
[INFO] Apache ZooKeeper - Assembly ........................ SKIPPED
[INFO] ------------------------------------------------------------------------
[INFO] BUILD FAILURE
[INFO] ------------------------------------------------------------------------
[INFO] Total time:  31.376 s
[INFO] Finished at: 2019-08-01T06:26:32Z
[INFO] ------------------------------------------------------------------------
Waiting for Jenkins to finish collecting data
[ERROR] Failed to execute goal org.owasp:dependency-check-maven:5.1.0:check (default-cli)
on project parent: Fatal exception(s) analyzing Apache ZooKeeper: One or more exceptions occurred
during analysis:
[ERROR] Unable to download meta file: https://nvd.nist.gov/feeds/json/cve/1.0/nvdcve-1.0-modified.meta
[ERROR] No documents exist
[ERROR] -> [Help 1]
[ERROR] 
[ERROR] To see the full stack trace of the errors, re-run Maven with the -e switch.
[ERROR] Re-run Maven using the -X switch to enable full debug logging.
[ERROR] 
[ERROR] For more information about the errors and possible solutions, please read the following
articles:
[ERROR] [Help 1] http://cwiki.apache.org/confluence/display/MAVEN/MojoExecutionException
[JENKINS] Archiving <https://builds.apache.org/job/zookeeper-master-maven-owasp/ws/zookeeper-server/pom.xml>
to org.apache.zookeeper/zookeeper/3.6.0-SNAPSHOT/zookeeper-3.6.0-SNAPSHOT.pom
[JENKINS] Archiving <https://builds.apache.org/job/zookeeper-master-maven-owasp/ws/zookeeper-client/pom.xml>
to org.apache.zookeeper/zookeeper-client/3.6.0-SNAPSHOT/zookeeper-client-3.6.0-SNAPSHOT.pom
[JENKINS] Archiving <https://builds.apache.org/job/zookeeper-master-maven-owasp/ws/zookeeper-jute/pom.xml>
to org.apache.zookeeper/zookeeper-jute/3.6.0-SNAPSHOT/zookeeper-jute-3.6.0-SNAPSHOT.pom
[JENKINS] Archiving <https://builds.apache.org/job/zookeeper-master-maven-owasp/ws/zookeeper-metrics-providers/pom.xml>
to org.apache.zookeeper/zookeeper-metrics-providers/3.6.0-SNAPSHOT/zookeeper-metrics-providers-3.6.0-SNAPSHOT.pom
[JENKINS] Archiving <https://builds.apache.org/job/zookeeper-master-maven-owasp/ws/zookeeper-metrics-providers/zookeeper-prometheus-metrics/pom.xml>
to org.apache.zookeeper/zookeeper-prometheus-metrics/3.6.0-SNAPSHOT/zookeeper-prometheus-metrics-3.6.0-SNAPSHOT.pom
[JENKINS] Archiving <https://builds.apache.org/job/zookeeper-master-maven-owasp/ws/zookeeper-recipes/zookeeper-recipes-election/pom.xml>
to org.apache.zookeeper/zookeeper-recipes-election/3.6.0-SNAPSHOT/zookeeper-recipes-election-3.6.0-SNAPSHOT.pom
[JENKINS] Archiving <https://builds.apache.org/job/zookeeper-master-maven-owasp/ws/zookeeper-recipes/zookeeper-recipes-queue/pom.xml>
to org.apache.zookeeper/zookeeper-recipes-queue/3.6.0-SNAPSHOT/zookeeper-recipes-queue-3.6.0-SNAPSHOT.pom
[JENKINS] Archiving <https://builds.apache.org/job/zookeeper-master-maven-owasp/ws/zookeeper-docs/pom.xml>
to org.apache.zookeeper/zookeeper-docs/3.6.0-SNAPSHOT/zookeeper-docs-3.6.0-SNAPSHOT.pom
[JENKINS] Archiving <https://builds.apache.org/job/zookeeper-master-maven-owasp/ws/zookeeper-recipes/pom.xml>
to org.apache.zookeeper/zookeeper-recipes/3.6.0-SNAPSHOT/zookeeper-recipes-3.6.0-SNAPSHOT.pom
[JENKINS] Archiving <https://builds.apache.org/job/zookeeper-master-maven-owasp/ws/pom.xml>
to org.apache.zookeeper/parent/3.6.0-SNAPSHOT/parent-3.6.0-SNAPSHOT.pom
[JENKINS] Archiving <https://builds.apache.org/job/zookeeper-master-maven-owasp/ws/zookeeper-recipes/zookeeper-recipes-lock/pom.xml>
to org.apache.zookeeper/zookeeper-recipes-lock/3.6.0-SNAPSHOT/zookeeper-recipes-lock-3.6.0-SNAPSHOT.pom
[JENKINS] Archiving <https://builds.apache.org/job/zookeeper-master-maven-owasp/ws/zookeeper-assembly/pom.xml>
to org.apache.zookeeper/zookeeper-assembly/3.6.0-SNAPSHOT/zookeeper-assembly-3.6.0-SNAPSHOT.pom
channel stopped
[SpotBugs] Skipping execution of recorder since overall result is 'FAILURE'

Mime
View raw message