zookeeper-dev mailing list archives

Site index · List index
Message view « Date » · « Thread »
Top « Date » · « Thread »
From Apache Jenkins Server <jenk...@builds.apache.org>
Subject Build failed in Jenkins: zookeeper-master-maven-owasp #18
Date Mon, 01 Jul 2019 13:33:03 GMT
See <https://builds.apache.org/job/zookeeper-master-maven-owasp/18/display/redirect?page=changes>

Changes:

[andor] ZOOKEEPER-3370: Remove SVN specific revision generation

------------------------------------------
[...truncated 242.11 KB...]
Generating <https://builds.apache.org/job/zookeeper-master-maven-owasp/ws/zookeeper-server/target/apidocs/org/apache/zookeeper/server/command/class-use/CommandExecutor.html...>
Generating <https://builds.apache.org/job/zookeeper-master-maven-owasp/ws/zookeeper-server/target/apidocs/org/apache/zookeeper/server/command/class-use/NopCommand.html...>
Generating <https://builds.apache.org/job/zookeeper-master-maven-owasp/ws/zookeeper-server/target/apidocs/org/apache/zookeeper/server/command/class-use/ConsCommand.html...>
Generating <https://builds.apache.org/job/zookeeper-master-maven-owasp/ws/zookeeper-server/target/apidocs/org/apache/zookeeper/server/command/class-use/DumpCommand.html...>
Generating <https://builds.apache.org/job/zookeeper-master-maven-owasp/ws/zookeeper-server/target/apidocs/org/apache/zookeeper/server/command/class-use/StatCommand.html...>
Generating <https://builds.apache.org/job/zookeeper-master-maven-owasp/ws/zookeeper-server/target/apidocs/org/apache/zookeeper/server/command/class-use/IsroCommand.html...>
Generating <https://builds.apache.org/job/zookeeper-master-maven-owasp/ws/zookeeper-server/target/apidocs/org/apache/zookeeper/server/command/class-use/WatchCommand.html...>
Generating <https://builds.apache.org/job/zookeeper-master-maven-owasp/ws/zookeeper-server/target/apidocs/org/apache/zookeeper/server/command/class-use/FourLetterCommands.html...>
Generating <https://builds.apache.org/job/zookeeper-master-maven-owasp/ws/zookeeper-server/target/apidocs/org/apache/zookeeper/server/command/class-use/AbstractFourLetterCommand.html...>
Generating <https://builds.apache.org/job/zookeeper-master-maven-owasp/ws/zookeeper-server/target/apidocs/org/apache/zookeeper/server/command/class-use/EnvCommand.html...>
Generating <https://builds.apache.org/job/zookeeper-master-maven-owasp/ws/zookeeper-server/target/apidocs/org/apache/zookeeper/server/command/class-use/DirsCommand.html...>
Generating <https://builds.apache.org/job/zookeeper-master-maven-owasp/ws/zookeeper-server/target/apidocs/org/apache/zookeeper/server/command/class-use/RuokCommand.html...>
Generating <https://builds.apache.org/job/zookeeper-master-maven-owasp/ws/zookeeper-server/target/apidocs/org/apache/zookeeper/server/command/class-use/StatResetCommand.html...>
Generating <https://builds.apache.org/job/zookeeper-master-maven-owasp/ws/zookeeper-server/target/apidocs/org/apache/zookeeper/server/command/class-use/TraceMaskCommand.html...>
Generating <https://builds.apache.org/job/zookeeper-master-maven-owasp/ws/zookeeper-server/target/apidocs/org/apache/zookeeper/server/command/class-use/SetTraceMaskCommand.html...>
Generating <https://builds.apache.org/job/zookeeper-master-maven-owasp/ws/zookeeper-server/target/apidocs/org/apache/zookeeper/server/command/class-use/ConfCommand.html...>
Generating <https://builds.apache.org/job/zookeeper-master-maven-owasp/ws/zookeeper-server/target/apidocs/org/apache/zookeeper/server/command/class-use/CnxnStatResetCommand.html...>
Generating <https://builds.apache.org/job/zookeeper-master-maven-owasp/ws/zookeeper-server/target/apidocs/org/apache/zookeeper/client/class-use/ConnectStringParser.html...>
Generating <https://builds.apache.org/job/zookeeper-master-maven-owasp/ws/zookeeper-server/target/apidocs/org/apache/zookeeper/client/class-use/ZooKeeperSaslClient.html...>
Generating <https://builds.apache.org/job/zookeeper-master-maven-owasp/ws/zookeeper-server/target/apidocs/org/apache/zookeeper/client/class-use/ZooKeeperSaslClient.SaslState.html...>
Generating <https://builds.apache.org/job/zookeeper-master-maven-owasp/ws/zookeeper-server/target/apidocs/org/apache/zookeeper/client/class-use/ZooKeeperSaslClient.ServerSaslResponseCallback.html...>
Generating <https://builds.apache.org/job/zookeeper-master-maven-owasp/ws/zookeeper-server/target/apidocs/org/apache/zookeeper/client/class-use/ZKClientConfig.html...>
Generating <https://builds.apache.org/job/zookeeper-master-maven-owasp/ws/zookeeper-server/target/apidocs/org/apache/zookeeper/client/class-use/HostProvider.html...>
Generating <https://builds.apache.org/job/zookeeper-master-maven-owasp/ws/zookeeper-server/target/apidocs/org/apache/zookeeper/client/class-use/StaticHostProvider.html...>
Generating <https://builds.apache.org/job/zookeeper-master-maven-owasp/ws/zookeeper-server/target/apidocs/org/apache/zookeeper/client/class-use/StaticHostProvider.Resolver.html...>
Generating <https://builds.apache.org/job/zookeeper-master-maven-owasp/ws/zookeeper-server/target/apidocs/org/apache/zookeeper/client/class-use/FourLetterWordMain.html...>
Generating <https://builds.apache.org/job/zookeeper-master-maven-owasp/ws/zookeeper-server/target/apidocs/org/apache/zookeeper/admin/class-use/ZooKeeperAdmin.html...>
Generating <https://builds.apache.org/job/zookeeper-master-maven-owasp/ws/zookeeper-server/target/apidocs/org/apache/zookeeper/util/class-use/SecurityUtils.html...>
Generating <https://builds.apache.org/job/zookeeper-master-maven-owasp/ws/zookeeper-server/target/apidocs/org/apache/zookeeper/util/class-use/PemReader.html...>
Generating <https://builds.apache.org/job/zookeeper-master-maven-owasp/ws/zookeeper-server/target/apidocs/org/apache/zookeeper/version/class-use/Info.html...>
Generating <https://builds.apache.org/job/zookeeper-master-maven-owasp/ws/zookeeper-server/target/apidocs/org/apache/zookeeper/version/class-use/VersionInfoMain.html...>
Generating <https://builds.apache.org/job/zookeeper-master-maven-owasp/ws/zookeeper-server/target/apidocs/org/apache/zookeeper/package-use.html...>
Generating <https://builds.apache.org/job/zookeeper-master-maven-owasp/ws/zookeeper-server/target/apidocs/org/apache/zookeeper/admin/package-use.html...>
Generating <https://builds.apache.org/job/zookeeper-master-maven-owasp/ws/zookeeper-server/target/apidocs/org/apache/zookeeper/cli/package-use.html...>
Generating <https://builds.apache.org/job/zookeeper-master-maven-owasp/ws/zookeeper-server/target/apidocs/org/apache/zookeeper/client/package-use.html...>
Generating <https://builds.apache.org/job/zookeeper-master-maven-owasp/ws/zookeeper-server/target/apidocs/org/apache/zookeeper/common/package-use.html...>
Generating <https://builds.apache.org/job/zookeeper-master-maven-owasp/ws/zookeeper-server/target/apidocs/org/apache/zookeeper/jmx/package-use.html...>
Generating <https://builds.apache.org/job/zookeeper-master-maven-owasp/ws/zookeeper-server/target/apidocs/org/apache/zookeeper/metrics/package-use.html...>
Generating <https://builds.apache.org/job/zookeeper-master-maven-owasp/ws/zookeeper-server/target/apidocs/org/apache/zookeeper/metrics/impl/package-use.html...>
Generating <https://builds.apache.org/job/zookeeper-master-maven-owasp/ws/zookeeper-server/target/apidocs/org/apache/zookeeper/server/package-use.html...>
Generating <https://builds.apache.org/job/zookeeper-master-maven-owasp/ws/zookeeper-server/target/apidocs/org/apache/zookeeper/server/admin/package-use.html...>
Generating <https://builds.apache.org/job/zookeeper-master-maven-owasp/ws/zookeeper-server/target/apidocs/org/apache/zookeeper/server/auth/package-use.html...>
Generating <https://builds.apache.org/job/zookeeper-master-maven-owasp/ws/zookeeper-server/target/apidocs/org/apache/zookeeper/server/command/package-use.html...>
Generating <https://builds.apache.org/job/zookeeper-master-maven-owasp/ws/zookeeper-server/target/apidocs/org/apache/zookeeper/server/metric/package-use.html...>
Generating <https://builds.apache.org/job/zookeeper-master-maven-owasp/ws/zookeeper-server/target/apidocs/org/apache/zookeeper/server/persistence/package-use.html...>
Generating <https://builds.apache.org/job/zookeeper-master-maven-owasp/ws/zookeeper-server/target/apidocs/org/apache/zookeeper/server/quorum/package-use.html...>
Generating <https://builds.apache.org/job/zookeeper-master-maven-owasp/ws/zookeeper-server/target/apidocs/org/apache/zookeeper/server/quorum/auth/package-use.html...>
Generating <https://builds.apache.org/job/zookeeper-master-maven-owasp/ws/zookeeper-server/target/apidocs/org/apache/zookeeper/server/quorum/flexible/package-use.html...>
Generating <https://builds.apache.org/job/zookeeper-master-maven-owasp/ws/zookeeper-server/target/apidocs/org/apache/zookeeper/server/util/package-use.html...>
Generating <https://builds.apache.org/job/zookeeper-master-maven-owasp/ws/zookeeper-server/target/apidocs/org/apache/zookeeper/server/watch/package-use.html...>
Generating <https://builds.apache.org/job/zookeeper-master-maven-owasp/ws/zookeeper-server/target/apidocs/org/apache/zookeeper/util/package-use.html...>
Generating <https://builds.apache.org/job/zookeeper-master-maven-owasp/ws/zookeeper-server/target/apidocs/org/apache/zookeeper/version/package-use.html...>
Generating <https://builds.apache.org/job/zookeeper-master-maven-owasp/ws/zookeeper-server/target/apidocs/org/apache/zookeeper/version/util/package-use.html...>
Building index for all the packages and classes...
Generating <https://builds.apache.org/job/zookeeper-master-maven-owasp/ws/zookeeper-server/target/apidocs/overview-tree.html...>
Generating <https://builds.apache.org/job/zookeeper-master-maven-owasp/ws/zookeeper-server/target/apidocs/index-all.html...>
Generating <https://builds.apache.org/job/zookeeper-master-maven-owasp/ws/zookeeper-server/target/apidocs/deprecated-list.html...>
Building index for all classes...
Generating <https://builds.apache.org/job/zookeeper-master-maven-owasp/ws/zookeeper-server/target/apidocs/allclasses-frame.html...>
Generating <https://builds.apache.org/job/zookeeper-master-maven-owasp/ws/zookeeper-server/target/apidocs/allclasses-noframe.html...>
Generating <https://builds.apache.org/job/zookeeper-master-maven-owasp/ws/zookeeper-server/target/apidocs/index.html...>
Generating <https://builds.apache.org/job/zookeeper-master-maven-owasp/ws/zookeeper-server/target/apidocs/overview-summary.html...>
Generating <https://builds.apache.org/job/zookeeper-master-maven-owasp/ws/zookeeper-server/target/apidocs/help-doc.html...>
20 warnings
[WARNING] Javadoc Warnings
[WARNING] <https://builds.apache.org/job/zookeeper-master-maven-owasp/ws/zookeeper-server/src/main/java/org/apache/zookeeper/cli/AclParser.java>:36:
warning - @return tag has no arguments.
[WARNING] <https://builds.apache.org/job/zookeeper-master-maven-owasp/ws/zookeeper-server/src/main/java/org/apache/zookeeper/cli/CliCommand.java>:75:
warning - @return tag has no arguments.
[WARNING] <https://builds.apache.org/job/zookeeper-master-maven-owasp/ws/zookeeper-server/src/main/java/org/apache/zookeeper/cli/CliCommand.java>:83:
warning - @return tag has no arguments.
[WARNING] <https://builds.apache.org/job/zookeeper-master-maven-owasp/ws/zookeeper-server/src/main/java/org/apache/zookeeper/cli/CliCommand.java>:91:
warning - @return tag has no arguments.
[WARNING] <https://builds.apache.org/job/zookeeper-master-maven-owasp/ws/zookeeper-server/src/main/java/org/apache/zookeeper/cli/CliCommand.java>:116:
warning - @return tag has no arguments.
[WARNING] <https://builds.apache.org/job/zookeeper-master-maven-owasp/ws/zookeeper-server/src/main/java/org/apache/zookeeper/server/ServerCnxn.java>:367:
warning - Tag @see: missing '#': "dumpConnectionInfo(PrintWriter, boolean) for brief stats"
[WARNING] <https://builds.apache.org/job/zookeeper-master-maven-owasp/ws/zookeeper-server/src/main/java/org/apache/zookeeper/server/ZKDatabase.java>:489:
warning - @return tag has no arguments.
[WARNING] <https://builds.apache.org/job/zookeeper-master-maven-owasp/ws/zookeeper-server/src/main/java/org/apache/zookeeper/server/quorum/Learner.java>:80:
warning - @return tag has no arguments.
[WARNING] <https://builds.apache.org/job/zookeeper-master-maven-owasp/ws/zookeeper-server/src/main/java/org/apache/zookeeper/server/quorum/Leader.java>:1157:
warning - @return tag has no arguments.
[WARNING] <https://builds.apache.org/job/zookeeper-master-maven-owasp/ws/zookeeper-server/src/main/java/org/apache/zookeeper/server/quorum/LearnerMaster.java>:74:
warning - @return tag has no arguments.
[WARNING] <https://builds.apache.org/job/zookeeper-master-maven-owasp/ws/zookeeper-server/src/main/java/org/apache/zookeeper/server/quorum/Leader.java>:280:
warning - @param argument "qv," is not a parameter name.
[WARNING] <https://builds.apache.org/job/zookeeper-master-maven-owasp/ws/zookeeper-server/src/main/java/org/apache/zookeeper/server/quorum/Leader.java>:925:
warning - @param argument "zxid," is not a parameter name.
[WARNING] <https://builds.apache.org/job/zookeeper-master-maven-owasp/ws/zookeeper-server/src/main/java/org/apache/zookeeper/server/quorum/Leader.java>:925:
warning - @param argument "sid," is not a parameter name.
[WARNING] <https://builds.apache.org/job/zookeeper-master-maven-owasp/ws/zookeeper-server/src/main/java/org/apache/zookeeper/server/quorum/LearnerHandler.java>:1104:
warning - @return tag has no arguments.
[WARNING] <https://builds.apache.org/job/zookeeper-master-maven-owasp/ws/zookeeper-server/src/main/java/org/apache/zookeeper/server/quorum/QuorumPeer.java>:1798:
warning - @return tag has no arguments.
[WARNING] <https://builds.apache.org/job/zookeeper-master-maven-owasp/ws/zookeeper-server/src/main/java/org/apache/zookeeper/server/persistence/FileTxnLog.java>:312:
warning - @return tag has no arguments.
[WARNING] <https://builds.apache.org/job/zookeeper-master-maven-owasp/ws/zookeeper-server/src/main/java/org/apache/zookeeper/server/persistence/FileTxnSnapLog.java>:509:
warning - @return tag has no arguments.
[WARNING] <https://builds.apache.org/job/zookeeper-master-maven-owasp/ws/zookeeper-server/src/main/java/org/apache/zookeeper/server/persistence/SnapStream.java>:222:
warning - @return tag has no arguments.
[WARNING] <https://builds.apache.org/job/zookeeper-master-maven-owasp/ws/zookeeper-server/src/main/java/org/apache/zookeeper/server/persistence/Util.java>:257:
warning - @return tag has no arguments.
[WARNING] <https://builds.apache.org/job/zookeeper-master-maven-owasp/ws/zookeeper-server/src/main/java/org/apache/zookeeper/server/persistence/Util.java>:267:
warning - @return tag has no arguments.
[INFO] Building jar: <https://builds.apache.org/job/zookeeper-master-maven-owasp/ws/zookeeper-server/target/zookeeper-3.6.0-SNAPSHOT-javadoc.jar>
[INFO] 
[INFO] --- maven-dependency-plugin:3.1.1:copy-dependencies (copy-dependencies) @ zookeeper
---
[INFO] Copying spotbugs-annotations-3.1.9.jar to <https://builds.apache.org/job/zookeeper-master-maven-owasp/ws/zookeeper-server/target/lib/spotbugs-annotations-3.1.9.jar>
[INFO] Copying jsr305-3.0.2.jar to <https://builds.apache.org/job/zookeeper-master-maven-owasp/ws/zookeeper-server/target/lib/jsr305-3.0.2.jar>
[INFO] Copying hamcrest-all-1.3.jar to <https://builds.apache.org/job/zookeeper-master-maven-owasp/ws/zookeeper-server/target/lib/hamcrest-all-1.3.jar>
[INFO] Copying commons-collections-3.2.2.jar to <https://builds.apache.org/job/zookeeper-master-maven-owasp/ws/zookeeper-server/target/lib/commons-collections-3.2.2.jar>
[INFO] Copying commons-lang-2.6.jar to <https://builds.apache.org/job/zookeeper-master-maven-owasp/ws/zookeeper-server/target/lib/commons-lang-2.6.jar>
[INFO] Copying zookeeper-jute-3.6.0-SNAPSHOT.jar to <https://builds.apache.org/job/zookeeper-master-maven-owasp/ws/zookeeper-server/target/lib/zookeeper-jute-3.6.0-SNAPSHOT.jar>
[INFO] Copying commons-cli-1.2.jar to <https://builds.apache.org/job/zookeeper-master-maven-owasp/ws/zookeeper-server/target/lib/commons-cli-1.2.jar>
[INFO] Copying audience-annotations-0.5.0.jar to <https://builds.apache.org/job/zookeeper-master-maven-owasp/ws/zookeeper-server/target/lib/audience-annotations-0.5.0.jar>
[INFO] Copying netty-all-4.1.36.Final.jar to <https://builds.apache.org/job/zookeeper-master-maven-owasp/ws/zookeeper-server/target/lib/netty-all-4.1.36.Final.jar>
[INFO] Copying slf4j-api-1.7.25.jar to <https://builds.apache.org/job/zookeeper-master-maven-owasp/ws/zookeeper-server/target/lib/slf4j-api-1.7.25.jar>
[INFO] Copying slf4j-log4j12-1.7.25.jar to <https://builds.apache.org/job/zookeeper-master-maven-owasp/ws/zookeeper-server/target/lib/slf4j-log4j12-1.7.25.jar>
[INFO] Copying jetty-server-9.4.17.v20190418.jar to <https://builds.apache.org/job/zookeeper-master-maven-owasp/ws/zookeeper-server/target/lib/jetty-server-9.4.17.v20190418.jar>
[INFO] Copying javax.servlet-api-3.1.0.jar to <https://builds.apache.org/job/zookeeper-master-maven-owasp/ws/zookeeper-server/target/lib/javax.servlet-api-3.1.0.jar>
[INFO] Copying jetty-http-9.4.17.v20190418.jar to <https://builds.apache.org/job/zookeeper-master-maven-owasp/ws/zookeeper-server/target/lib/jetty-http-9.4.17.v20190418.jar>
[INFO] Copying jetty-util-9.4.17.v20190418.jar to <https://builds.apache.org/job/zookeeper-master-maven-owasp/ws/zookeeper-server/target/lib/jetty-util-9.4.17.v20190418.jar>
[INFO] Copying jetty-io-9.4.17.v20190418.jar to <https://builds.apache.org/job/zookeeper-master-maven-owasp/ws/zookeeper-server/target/lib/jetty-io-9.4.17.v20190418.jar>
[INFO] Copying jetty-servlet-9.4.17.v20190418.jar to <https://builds.apache.org/job/zookeeper-master-maven-owasp/ws/zookeeper-server/target/lib/jetty-servlet-9.4.17.v20190418.jar>
[INFO] Copying jetty-security-9.4.17.v20190418.jar to <https://builds.apache.org/job/zookeeper-master-maven-owasp/ws/zookeeper-server/target/lib/jetty-security-9.4.17.v20190418.jar>
[INFO] Copying jackson-databind-2.9.9.jar to <https://builds.apache.org/job/zookeeper-master-maven-owasp/ws/zookeeper-server/target/lib/jackson-databind-2.9.9.jar>
[INFO] Copying jackson-annotations-2.9.0.jar to <https://builds.apache.org/job/zookeeper-master-maven-owasp/ws/zookeeper-server/target/lib/jackson-annotations-2.9.0.jar>
[INFO] Copying jackson-core-2.9.9.jar to <https://builds.apache.org/job/zookeeper-master-maven-owasp/ws/zookeeper-server/target/lib/jackson-core-2.9.9.jar>
[INFO] Copying json-simple-1.1.1.jar to <https://builds.apache.org/job/zookeeper-master-maven-owasp/ws/zookeeper-server/target/lib/json-simple-1.1.1.jar>
[INFO] Copying bcprov-jdk15on-1.60.jar to <https://builds.apache.org/job/zookeeper-master-maven-owasp/ws/zookeeper-server/target/lib/bcprov-jdk15on-1.60.jar>
[INFO] Copying bcpkix-jdk15on-1.60.jar to <https://builds.apache.org/job/zookeeper-master-maven-owasp/ws/zookeeper-server/target/lib/bcpkix-jdk15on-1.60.jar>
[INFO] Copying jline-2.11.jar to <https://builds.apache.org/job/zookeeper-master-maven-owasp/ws/zookeeper-server/target/lib/jline-2.11.jar>
[INFO] Copying metrics-core-3.2.5.jar to <https://builds.apache.org/job/zookeeper-master-maven-owasp/ws/zookeeper-server/target/lib/metrics-core-3.2.5.jar>
[INFO] Copying log4j-1.2.17.jar to <https://builds.apache.org/job/zookeeper-master-maven-owasp/ws/zookeeper-server/target/lib/log4j-1.2.17.jar>
[INFO] Copying kerb-core-1.1.0.jar to <https://builds.apache.org/job/zookeeper-master-maven-owasp/ws/zookeeper-server/target/lib/kerb-core-1.1.0.jar>
[INFO] Copying kerby-pkix-1.1.0.jar to <https://builds.apache.org/job/zookeeper-master-maven-owasp/ws/zookeeper-server/target/lib/kerby-pkix-1.1.0.jar>
[INFO] Copying kerby-asn1-1.1.0.jar to <https://builds.apache.org/job/zookeeper-master-maven-owasp/ws/zookeeper-server/target/lib/kerby-asn1-1.1.0.jar>
[INFO] Copying kerby-util-1.1.0.jar to <https://builds.apache.org/job/zookeeper-master-maven-owasp/ws/zookeeper-server/target/lib/kerby-util-1.1.0.jar>
[INFO] Copying kerb-simplekdc-1.1.0.jar to <https://builds.apache.org/job/zookeeper-master-maven-owasp/ws/zookeeper-server/target/lib/kerb-simplekdc-1.1.0.jar>
[INFO] Copying kerb-client-1.1.0.jar to <https://builds.apache.org/job/zookeeper-master-maven-owasp/ws/zookeeper-server/target/lib/kerb-client-1.1.0.jar>
[INFO] Copying kerb-common-1.1.0.jar to <https://builds.apache.org/job/zookeeper-master-maven-owasp/ws/zookeeper-server/target/lib/kerb-common-1.1.0.jar>
[INFO] Copying kerb-crypto-1.1.0.jar to <https://builds.apache.org/job/zookeeper-master-maven-owasp/ws/zookeeper-server/target/lib/kerb-crypto-1.1.0.jar>
[INFO] Copying commons-io-2.6.jar to <https://builds.apache.org/job/zookeeper-master-maven-owasp/ws/zookeeper-server/target/lib/commons-io-2.6.jar>
[INFO] Copying kerb-util-1.1.0.jar to <https://builds.apache.org/job/zookeeper-master-maven-owasp/ws/zookeeper-server/target/lib/kerb-util-1.1.0.jar>
[INFO] Copying token-provider-1.1.0.jar to <https://builds.apache.org/job/zookeeper-master-maven-owasp/ws/zookeeper-server/target/lib/token-provider-1.1.0.jar>
[INFO] Copying nimbus-jose-jwt-4.41.2.jar to <https://builds.apache.org/job/zookeeper-master-maven-owasp/ws/zookeeper-server/target/lib/nimbus-jose-jwt-4.41.2.jar>
[INFO] Copying jcip-annotations-1.0-1.jar to <https://builds.apache.org/job/zookeeper-master-maven-owasp/ws/zookeeper-server/target/lib/jcip-annotations-1.0-1.jar>
[INFO] Copying json-smart-2.3.jar to <https://builds.apache.org/job/zookeeper-master-maven-owasp/ws/zookeeper-server/target/lib/json-smart-2.3.jar>
[INFO] Copying accessors-smart-1.2.jar to <https://builds.apache.org/job/zookeeper-master-maven-owasp/ws/zookeeper-server/target/lib/accessors-smart-1.2.jar>
[INFO] Copying asm-5.0.4.jar to <https://builds.apache.org/job/zookeeper-master-maven-owasp/ws/zookeeper-server/target/lib/asm-5.0.4.jar>
[INFO] Copying kerb-admin-1.1.0.jar to <https://builds.apache.org/job/zookeeper-master-maven-owasp/ws/zookeeper-server/target/lib/kerb-admin-1.1.0.jar>
[INFO] Copying kerb-server-1.1.0.jar to <https://builds.apache.org/job/zookeeper-master-maven-owasp/ws/zookeeper-server/target/lib/kerb-server-1.1.0.jar>
[INFO] Copying kerb-identity-1.1.0.jar to <https://builds.apache.org/job/zookeeper-master-maven-owasp/ws/zookeeper-server/target/lib/kerb-identity-1.1.0.jar>
[INFO] Copying kerby-xdr-1.1.0.jar to <https://builds.apache.org/job/zookeeper-master-maven-owasp/ws/zookeeper-server/target/lib/kerby-xdr-1.1.0.jar>
[INFO] Copying kerby-config-1.1.0.jar to <https://builds.apache.org/job/zookeeper-master-maven-owasp/ws/zookeeper-server/target/lib/kerby-config-1.1.0.jar>
[INFO] Copying mockito-core-2.27.0.jar to <https://builds.apache.org/job/zookeeper-master-maven-owasp/ws/zookeeper-server/target/lib/mockito-core-2.27.0.jar>
[INFO] Copying byte-buddy-1.9.10.jar to <https://builds.apache.org/job/zookeeper-master-maven-owasp/ws/zookeeper-server/target/lib/byte-buddy-1.9.10.jar>
[INFO] Copying byte-buddy-agent-1.9.10.jar to <https://builds.apache.org/job/zookeeper-master-maven-owasp/ws/zookeeper-server/target/lib/byte-buddy-agent-1.9.10.jar>
[INFO] Copying objenesis-2.6.jar to <https://builds.apache.org/job/zookeeper-master-maven-owasp/ws/zookeeper-server/target/lib/objenesis-2.6.jar>
[INFO] Copying junit-4.12.jar to <https://builds.apache.org/job/zookeeper-master-maven-owasp/ws/zookeeper-server/target/lib/junit-4.12.jar>
[INFO] Copying hamcrest-core-1.3.jar to <https://builds.apache.org/job/zookeeper-master-maven-owasp/ws/zookeeper-server/target/lib/hamcrest-core-1.3.jar>
[INFO] Copying snappy-java-1.1.7.jar to <https://builds.apache.org/job/zookeeper-master-maven-owasp/ws/zookeeper-server/target/lib/snappy-java-1.1.7.jar>
[INFO] 
[INFO] --- dependency-check-maven:4.0.2:check (default-cli) @ zookeeper ---
[INFO] Central analyzer disabled
[INFO] Checking for updates
[INFO] Skipping NVD check since last check was within 4 hours.
[INFO] Skipping RetireJS update since last update was within 24 hours.
[INFO] Check for updates complete (13 ms)
[INFO] Analysis Started
[INFO] Finished Archive Analyzer (0 seconds)
[INFO] Finished File Name Analyzer (0 seconds)
[INFO] Finished Jar Analyzer (0 seconds)
[INFO] Finished Assembly Analyzer (0 seconds)
[INFO] Finished Dependency Merging Analyzer (0 seconds)
[INFO] Finished Version Filter Analyzer (0 seconds)
[INFO] Finished Hint Analyzer (0 seconds)
[INFO] Created CPE Index (0 seconds)
[INFO] Skipping CPE Analysis for npm
[INFO] Finished CPE Analyzer (1 seconds)
[INFO] Finished False Positive Analyzer (0 seconds)
[INFO] Finished NVD CVE Analyzer (0 seconds)
[INFO] Finished Vulnerability Suppression Analyzer (0 seconds)
[INFO] Finished Dependency Bundling Analyzer (0 seconds)
[INFO] Analysis Complete (2 seconds)
[WARNING] 

One or more dependencies were identified with known vulnerabilities in Apache ZooKeeper -
Server:

jackson-databind-2.9.9.jar (cpe:/a:fasterxml:jackson:2.9.9, cpe:/a:fasterxml:jackson-databind:2.9.9,
com.fasterxml.jackson.core:jackson-databind:2.9.9) : CVE-2019-12814


See the dependency-check report for more details.


[INFO] ------------------------------------------------------------------------
[INFO] Reactor Summary for Apache ZooKeeper 3.6.0-SNAPSHOT:
[INFO] 
[INFO] Apache ZooKeeper ................................... SUCCESS [04:33 min]
[INFO] Apache ZooKeeper - Documentation ................... SUCCESS [  8.843 s]
[INFO] Apache ZooKeeper - Jute ............................ SUCCESS [ 17.566 s]
[INFO] Apache ZooKeeper - Server .......................... FAILURE [ 29.132 s]
[INFO] Apache ZooKeeper - Metrics Providers ............... SKIPPED
[INFO] Apache ZooKeeper - Prometheus.io Metrics Provider .. SKIPPED
[INFO] Apache ZooKeeper - Client .......................... SKIPPED
[INFO] Apache ZooKeeper - Recipes ......................... SKIPPED
[INFO] Apache ZooKeeper - Recipes - Election .............. SKIPPED
[INFO] Apache ZooKeeper - Recipes - Lock .................. SKIPPED
[INFO] Apache ZooKeeper - Recipes - Queue ................. SKIPPED
[INFO] Apache ZooKeeper - Assembly ........................ SKIPPED
[INFO] ------------------------------------------------------------------------
[INFO] BUILD FAILURE
[INFO] ------------------------------------------------------------------------
[INFO] Total time:  05:58 min
[INFO] Finished at: 2019-07-01T13:32:38Z
[INFO] ------------------------------------------------------------------------
Waiting for Jenkins to finish collecting data
[ERROR] Failed to execute goal org.owasp:dependency-check-maven:4.0.2:check (default-cli)
on project zookeeper:
[ERROR] 
[ERROR] One or more dependencies were identified with vulnerabilities that have a CVSS score
greater than or equal to '0.0':
[ERROR] 
[ERROR] jackson-databind-2.9.9.jar: CVE-2019-12814
[ERROR] 
[ERROR] See the dependency-check report for more details.
[ERROR] -> [Help 1]
[ERROR] 
[ERROR] To see the full stack trace of the errors, re-run Maven with the -e switch.
[ERROR] Re-run Maven using the -X switch to enable full debug logging.
[ERROR] 
[ERROR] For more information about the errors and possible solutions, please read the following
articles:
[ERROR] [Help 1] http://cwiki.apache.org/confluence/display/MAVEN/MojoFailureException
[ERROR] 
[ERROR] After correcting the problems, you can resume the build with the command
[ERROR]   mvn <goals> -rf :zookeeper
[JENKINS] Archiving <https://builds.apache.org/job/zookeeper-master-maven-owasp/ws/zookeeper-server/pom.xml>
to org.apache.zookeeper/zookeeper/3.6.0-SNAPSHOT/zookeeper-3.6.0-SNAPSHOT.pom
[JENKINS] Archiving <https://builds.apache.org/job/zookeeper-master-maven-owasp/ws/zookeeper-server/target/zookeeper-3.6.0-SNAPSHOT.jar>
to org.apache.zookeeper/zookeeper/3.6.0-SNAPSHOT/zookeeper-3.6.0-SNAPSHOT.jar
[JENKINS] Archiving <https://builds.apache.org/job/zookeeper-master-maven-owasp/ws/zookeeper-server/target/zookeeper-3.6.0-SNAPSHOT-tests.jar>
to org.apache.zookeeper/zookeeper/3.6.0-SNAPSHOT/zookeeper-3.6.0-SNAPSHOT-tests.jar
[JENKINS] Archiving <https://builds.apache.org/job/zookeeper-master-maven-owasp/ws/zookeeper-server/target/zookeeper-3.6.0-SNAPSHOT-sources.jar>
to org.apache.zookeeper/zookeeper/3.6.0-SNAPSHOT/zookeeper-3.6.0-SNAPSHOT-sources.jar
[JENKINS] Archiving <https://builds.apache.org/job/zookeeper-master-maven-owasp/ws/zookeeper-server/target/zookeeper-3.6.0-SNAPSHOT-javadoc.jar>
to org.apache.zookeeper/zookeeper/3.6.0-SNAPSHOT/zookeeper-3.6.0-SNAPSHOT-javadoc.jar
[Fast Archiver] No prior successful build to compare, so performing full copy of artifacts
[JENKINS] Archiving <https://builds.apache.org/job/zookeeper-master-maven-owasp/ws/zookeeper-client/pom.xml>
to org.apache.zookeeper/zookeeper-client/3.6.0-SNAPSHOT/zookeeper-client-3.6.0-SNAPSHOT.pom
[Fast Archiver] No prior successful build to compare, so performing full copy of artifacts
[JENKINS] Archiving <https://builds.apache.org/job/zookeeper-master-maven-owasp/ws/zookeeper-jute/pom.xml>
to org.apache.zookeeper/zookeeper-jute/3.6.0-SNAPSHOT/zookeeper-jute-3.6.0-SNAPSHOT.pom
[JENKINS] Archiving <https://builds.apache.org/job/zookeeper-master-maven-owasp/ws/zookeeper-jute/target/zookeeper-jute-3.6.0-SNAPSHOT.jar>
to org.apache.zookeeper/zookeeper-jute/3.6.0-SNAPSHOT/zookeeper-jute-3.6.0-SNAPSHOT.jar
[JENKINS] Archiving <https://builds.apache.org/job/zookeeper-master-maven-owasp/ws/zookeeper-jute/target/zookeeper-jute-3.6.0-SNAPSHOT-tests.jar>
to org.apache.zookeeper/zookeeper-jute/3.6.0-SNAPSHOT/zookeeper-jute-3.6.0-SNAPSHOT-tests.jar
[JENKINS] Archiving <https://builds.apache.org/job/zookeeper-master-maven-owasp/ws/zookeeper-jute/target/zookeeper-jute-3.6.0-SNAPSHOT-sources.jar>
to org.apache.zookeeper/zookeeper-jute/3.6.0-SNAPSHOT/zookeeper-jute-3.6.0-SNAPSHOT-sources.jar
[JENKINS] Archiving <https://builds.apache.org/job/zookeeper-master-maven-owasp/ws/zookeeper-jute/target/zookeeper-jute-3.6.0-SNAPSHOT-javadoc.jar>
to org.apache.zookeeper/zookeeper-jute/3.6.0-SNAPSHOT/zookeeper-jute-3.6.0-SNAPSHOT-javadoc.jar
[JENKINS] Archiving <https://builds.apache.org/job/zookeeper-master-maven-owasp/ws/zookeeper-metrics-providers/pom.xml>
to org.apache.zookeeper/zookeeper-metrics-providers/3.6.0-SNAPSHOT/zookeeper-metrics-providers-3.6.0-SNAPSHOT.pom
[Fast Archiver] No prior successful build to compare, so performing full copy of artifacts
[JENKINS] Archiving <https://builds.apache.org/job/zookeeper-master-maven-owasp/ws/zookeeper-metrics-providers/zookeeper-prometheus-metrics/pom.xml>
to org.apache.zookeeper/zookeeper-prometheus-metrics/3.6.0-SNAPSHOT/zookeeper-prometheus-metrics-3.6.0-SNAPSHOT.pom
[Fast Archiver] No prior successful build to compare, so performing full copy of artifacts
[JENKINS] Archiving <https://builds.apache.org/job/zookeeper-master-maven-owasp/ws/zookeeper-recipes/zookeeper-recipes-election/pom.xml>
to org.apache.zookeeper/zookeeper-recipes-election/3.6.0-SNAPSHOT/zookeeper-recipes-election-3.6.0-SNAPSHOT.pom
[Fast Archiver] No prior successful build to compare, so performing full copy of artifacts
[JENKINS] Archiving <https://builds.apache.org/job/zookeeper-master-maven-owasp/ws/zookeeper-recipes/zookeeper-recipes-queue/pom.xml>
to org.apache.zookeeper/zookeeper-recipes-queue/3.6.0-SNAPSHOT/zookeeper-recipes-queue-3.6.0-SNAPSHOT.pom
[Fast Archiver] No prior successful build to compare, so performing full copy of artifacts
[JENKINS] Archiving <https://builds.apache.org/job/zookeeper-master-maven-owasp/ws/zookeeper-docs/pom.xml>
to org.apache.zookeeper/zookeeper-docs/3.6.0-SNAPSHOT/zookeeper-docs-3.6.0-SNAPSHOT.pom
[JENKINS] Archiving <https://builds.apache.org/job/zookeeper-master-maven-owasp/ws/zookeeper-docs/target/zookeeper-docs-3.6.0-SNAPSHOT.jar>
to org.apache.zookeeper/zookeeper-docs/3.6.0-SNAPSHOT/zookeeper-docs-3.6.0-SNAPSHOT.jar
[JENKINS] Archiving <https://builds.apache.org/job/zookeeper-master-maven-owasp/ws/zookeeper-docs/target/zookeeper-docs-3.6.0-SNAPSHOT-tests.jar>
to org.apache.zookeeper/zookeeper-docs/3.6.0-SNAPSHOT/zookeeper-docs-3.6.0-SNAPSHOT-tests.jar
[JENKINS] Archiving <https://builds.apache.org/job/zookeeper-master-maven-owasp/ws/zookeeper-docs/target/zookeeper-docs-3.6.0-SNAPSHOT-sources.jar>
to org.apache.zookeeper/zookeeper-docs/3.6.0-SNAPSHOT/zookeeper-docs-3.6.0-SNAPSHOT-sources.jar
[JENKINS] Archiving <https://builds.apache.org/job/zookeeper-master-maven-owasp/ws/zookeeper-recipes/pom.xml>
to org.apache.zookeeper/zookeeper-recipes/3.6.0-SNAPSHOT/zookeeper-recipes-3.6.0-SNAPSHOT.pom
[Fast Archiver] No prior successful build to compare, so performing full copy of artifacts
[JENKINS] Archiving <https://builds.apache.org/job/zookeeper-master-maven-owasp/ws/pom.xml>
to org.apache.zookeeper/parent/3.6.0-SNAPSHOT/parent-3.6.0-SNAPSHOT.pom
[JENKINS] Archiving <https://builds.apache.org/job/zookeeper-master-maven-owasp/ws/zookeeper-recipes/zookeeper-recipes-lock/pom.xml>
to org.apache.zookeeper/zookeeper-recipes-lock/3.6.0-SNAPSHOT/zookeeper-recipes-lock-3.6.0-SNAPSHOT.pom
[Fast Archiver] No prior successful build to compare, so performing full copy of artifacts
[JENKINS] Archiving <https://builds.apache.org/job/zookeeper-master-maven-owasp/ws/zookeeper-assembly/pom.xml>
to org.apache.zookeeper/zookeeper-assembly/3.6.0-SNAPSHOT/zookeeper-assembly-3.6.0-SNAPSHOT.pom
[Fast Archiver] No prior successful build to compare, so performing full copy of artifacts
channel stopped
[SpotBugs] Skipping execution of recorder since overall result is 'FAILURE'

Mime
View raw message