zookeeper-dev mailing list archives

Site index · List index
Message view « Date » · « Thread »
Top « Date » · « Thread »
From Apache Jenkins Server <jenk...@builds.apache.org>
Subject ZooKeeper_branch34_openjdk8 - Build # 389 - Failure
Date Tue, 16 Jul 2019 15:48:34 GMT
See https://builds.apache.org/job/ZooKeeper_branch34_openjdk8/389/

###################################################################################
########################## LAST 60 LINES OF THE CONSOLE ###########################
[...truncated 44.22 KB...]
    [junit] Running org.apache.zookeeper.test.SaslAuthFailNotifyTest
    [junit] Tests run: 1, Failures: 0, Errors: 0, Skipped: 0, Time elapsed: 0.548 sec
    [junit] Running org.apache.zookeeper.test.SaslAuthFailTest
    [junit] Tests run: 1, Failures: 0, Errors: 0, Skipped: 0, Time elapsed: 0.618 sec
    [junit] Running org.apache.zookeeper.test.SaslAuthMissingClientConfigTest
    [junit] Tests run: 1, Failures: 0, Errors: 0, Skipped: 0, Time elapsed: 0.496 sec
    [junit] Running org.apache.zookeeper.test.SaslClientTest
    [junit] Tests run: 1, Failures: 0, Errors: 0, Skipped: 0, Time elapsed: 0.087 sec
    [junit] Running org.apache.zookeeper.test.SessionInvalidationTest
    [junit] Tests run: 1, Failures: 0, Errors: 0, Skipped: 0, Time elapsed: 0.527 sec
    [junit] Running org.apache.zookeeper.test.SessionTest
    [junit] Tests run: 5, Failures: 0, Errors: 0, Skipped: 0, Time elapsed: 11.27 sec
    [junit] Running org.apache.zookeeper.test.SessionTimeoutTest
    [junit] Tests run: 4, Failures: 0, Errors: 0, Skipped: 0, Time elapsed: 0.772 sec
    [junit] Running org.apache.zookeeper.test.StandaloneTest
    [junit] Tests run: 1, Failures: 0, Errors: 0, Skipped: 0, Time elapsed: 0.933 sec
    [junit] Running org.apache.zookeeper.test.StatTest
    [junit] Tests run: 4, Failures: 0, Errors: 0, Skipped: 0, Time elapsed: 0.651 sec
    [junit] Running org.apache.zookeeper.test.StaticHostProviderTest
    [junit] Tests run: 13, Failures: 0, Errors: 0, Skipped: 0, Time elapsed: 1.733 sec
    [junit] Running org.apache.zookeeper.test.SyncCallTest
    [junit] Tests run: 1, Failures: 0, Errors: 0, Skipped: 0, Time elapsed: 0.549 sec
    [junit] Running org.apache.zookeeper.test.TruncateTest
    [junit] Tests run: 3, Failures: 0, Errors: 0, Skipped: 0, Time elapsed: 8.148 sec
    [junit] Running org.apache.zookeeper.test.UpgradeTest
    [junit] Tests run: 1, Failures: 0, Errors: 0, Skipped: 0, Time elapsed: 0.892 sec
    [junit] Running org.apache.zookeeper.test.WatchedEventTest
    [junit] Tests run: 4, Failures: 0, Errors: 0, Skipped: 0, Time elapsed: 0.084 sec
    [junit] Running org.apache.zookeeper.test.WatcherFuncTest
    [junit] Tests run: 6, Failures: 0, Errors: 0, Skipped: 0, Time elapsed: 0.758 sec
    [junit] Running org.apache.zookeeper.test.WatcherTest
    [junit] Tests run: 7, Failures: 0, Errors: 0, Skipped: 0, Time elapsed: 29.259 sec
    [junit] Running org.apache.zookeeper.test.ZkDatabaseCorruptionTest
    [junit] Tests run: 1, Failures: 0, Errors: 0, Skipped: 0, Time elapsed: 5.245 sec
    [junit] Running org.apache.zookeeper.test.ZooKeeperQuotaTest
    [junit] Tests run: 1, Failures: 0, Errors: 0, Skipped: 0, Time elapsed: 0.63 sec
    [junit] Running org.apache.jute.BinaryInputArchiveTest
    [junit] Tests run: 1, Failures: 0, Errors: 0, Skipped: 0, Time elapsed: 0.082 sec

fail.build.on.test.failure:

BUILD FAILED
/home/jenkins/jenkins-slave/workspace/ZooKeeper_branch34_openjdk8/build.xml:1425: The following
error occurred while executing this line:
/home/jenkins/jenkins-slave/workspace/ZooKeeper_branch34_openjdk8/build.xml:1428: Tests failed!

Total time: 28 minutes 53 seconds
Build step 'Invoke Ant' marked build as failure
Archiving artifacts
Setting OPENJDK_8_ON_UBUNTU_ONLY__HOME=/usr/lib/jvm/java-8-openjdk-amd64/
Recording test results
Setting OPENJDK_8_ON_UBUNTU_ONLY__HOME=/usr/lib/jvm/java-8-openjdk-amd64/
Setting OPENJDK_8_ON_UBUNTU_ONLY__HOME=/usr/lib/jvm/java-8-openjdk-amd64/
Setting OPENJDK_8_ON_UBUNTU_ONLY__HOME=/usr/lib/jvm/java-8-openjdk-amd64/
Email was triggered for: Failure - Any
Sending email for trigger: Failure - Any
Setting OPENJDK_8_ON_UBUNTU_ONLY__HOME=/usr/lib/jvm/java-8-openjdk-amd64/
Setting OPENJDK_8_ON_UBUNTU_ONLY__HOME=/usr/lib/jvm/java-8-openjdk-amd64/
Setting OPENJDK_8_ON_UBUNTU_ONLY__HOME=/usr/lib/jvm/java-8-openjdk-amd64/
Setting OPENJDK_8_ON_UBUNTU_ONLY__HOME=/usr/lib/jvm/java-8-openjdk-amd64/



###################################################################################
############################## FAILED TESTS (if any) ##############################
1 tests failed.
FAILED:  org.apache.zookeeper.server.quorum.EphemeralNodeDeletionTest.testEphemeralNodeDeletion

Error Message:
After session close ephemeral node must be deleted expected null, but was:<4294967302,4294967302,1563290577673,1563290577673,0,0,0,145575150357250048,1,0,4294967302
>

Stack Trace:
junit.framework.AssertionFailedError: After session close ephemeral node must be deleted expected
null, but was:<4294967302,4294967302,1563290577673,1563290577673,0,0,0,145575150357250048,1,0,4294967302
>
	at org.apache.zookeeper.server.quorum.EphemeralNodeDeletionTest.testEphemeralNodeDeletion(EphemeralNodeDeletionTest.java:147)
	at org.apache.zookeeper.JUnit4ZKTestRunner$LoggedInvokeMethod.evaluate(JUnit4ZKTestRunner.java:55)
	at java.util.concurrent.FutureTask.run(FutureTask.java:266)
	at java.lang.Thread.run(Thread.java:748)
Mime
  • Unnamed multipart/mixed (inline, None, 0 bytes)
View raw message