zookeeper-dev mailing list archives

Site index · List index
Message view « Date » · « Thread »
Top « Date » · « Thread »
From Apache Jenkins Server <jenk...@builds.apache.org>
Subject Build failed in Jenkins: ZooKeeper-trunk-owasp #414
Date Tue, 02 Jul 2019 09:19:47 GMT
See <https://builds.apache.org/job/ZooKeeper-trunk-owasp/414/display/redirect?page=changes>

Changes:

[andor] ZOOKEEPER-3370: Remove SVN specific revision generation

[andor] ZOOKEEPER-3240: Close socket on Learner shutdown to avoid dangling so…

------------------------------------------
[...truncated 17.76 KB...]
   [javacc] File "ParseException.java" does not exist.  Will create one.
   [javacc] File "Token.java" does not exist.  Will create one.
   [javacc] File "SimpleCharStream.java" does not exist.  Will create one.
   [javacc] Parser generated successfully.

jute:
    [javac] Compiling 36 source files to <https://builds.apache.org/job/ZooKeeper-trunk-owasp/ws/build/classes>
    [javac] warning: [options] bootstrap class path not set in conjunction with -source 8
    [javac] 1 warning

compile_jute_uptodate:

compile_jute:
    [mkdir] Created dir: <https://builds.apache.org/job/ZooKeeper-trunk-owasp/ws/zookeeper-jute/target/main/java>
    [mkdir] Created dir: <https://builds.apache.org/job/ZooKeeper-trunk-owasp/ws/zookeeper-client/zookeeper-client-c/generated>
     [java] ../../../src/main/resources/zookeeper.jute Parsed Successfully
     [java] ../../../zookeeper-jute/src/main/resources/zookeeper.jute Parsed Successfully
    [touch] Creating <https://builds.apache.org/job/ZooKeeper-trunk-owasp/ws/zookeeper-jute/target/main/java/.generated>

ver-gen:
    [javac] Compiling 1 source file to <https://builds.apache.org/job/ZooKeeper-trunk-owasp/ws/build/classes>
    [javac] warning: [options] bootstrap class path not set in conjunction with -source 8
    [javac] 1 warning

git-revision:
    [mkdir] Created dir: <https://builds.apache.org/job/ZooKeeper-trunk-owasp/ws/.revision>

version-info:

process-template:

build-generated:
    [javac] Compiling 66 source files to <https://builds.apache.org/job/ZooKeeper-trunk-owasp/ws/build/classes>
    [javac] warning: [options] bootstrap class path not set in conjunction with -source 8
    [javac] 1 warning

compile:
    [javac] Compiling 318 source files to <https://builds.apache.org/job/ZooKeeper-trunk-owasp/ws/build/classes>
    [javac] warning: [options] bootstrap class path not set in conjunction with -source 8
    [javac] <https://builds.apache.org/job/ZooKeeper-trunk-owasp/ws/zookeeper-server/src/main/java/org/apache/zookeeper/server/NIOServerCnxn.java>:247:
warning: [cast] redundant cast to ByteBuffer
    [javac]                     b = (ByteBuffer) b.slice().limit(
    [javac]                         ^
    [javac] <https://builds.apache.org/job/ZooKeeper-trunk-owasp/ws/zookeeper-server/src/main/java/org/apache/zookeeper/server/persistence/FilePadding.java>:78:
warning: [cast] redundant cast to ByteBuffer
    [javac]             fileChannel.write((ByteBuffer) fill.position(0), newFileSize - fill.remaining());
    [javac]                               ^
    [javac] 3 warnings

compile-test:
    [mkdir] Created dir: <https://builds.apache.org/job/ZooKeeper-trunk-owasp/ws/build/test/classes>
    [javac] Compiling 288 source files to <https://builds.apache.org/job/ZooKeeper-trunk-owasp/ws/build/test/classes>
    [javac] warning: [options] bootstrap class path not set in conjunction with -source 8
    [javac] 1 warning
    [javac] Compiling 11 source files to <https://builds.apache.org/job/ZooKeeper-trunk-owasp/ws/build/test/classes>
    [javac] warning: [options] bootstrap class path not set in conjunction with -source 8
    [javac] Note: Some input files use or override a deprecated API.
    [javac] Note: Recompile with -Xlint:deprecation for details.
    [javac] 1 warning
    [javac] Compiling 2 source files to <https://builds.apache.org/job/ZooKeeper-trunk-owasp/ws/build/test/classes>
    [javac] warning: [options] bootstrap class path not set in conjunction with -source 8
    [javac] Note: <https://builds.apache.org/job/ZooKeeper-trunk-owasp/ws/zookeeper-it/src/test/bench/org/apache/zookeeper/server/watch/WatchBench.java>
uses or overrides a deprecated API.
    [javac] Note: Recompile with -Xlint:deprecation for details.
    [javac] 1 warning

init:

ivy-download:

ivy-taskdef:

ivy-init:

ivy-retrieve-owasp:
[ivy:retrieve] :: loading settings :: file = <https://builds.apache.org/job/ZooKeeper-trunk-owasp/ws/ivysettings.xml>
[ivy:retrieve] :: resolving dependencies :: org.apache.zookeeper#zookeeper;3.6.0-SNAPSHOT
[ivy:retrieve] 	confs: [owasp]
[ivy:retrieve] 	found org.owasp#dependency-check-ant;4.0.2 in maven2
[ivy:retrieve] 	found org.owasp#dependency-check-core;4.0.2 in maven2
[ivy:retrieve] 	found com.vdurmont#semver4j;2.2.0 in maven2
[ivy:retrieve] 	found joda-time#joda-time;1.6 in maven2
[ivy:retrieve] 	found org.slf4j#slf4j-api;1.7.25 in maven2
[ivy:retrieve] 	found org.owasp#dependency-check-utils;4.0.2 in maven2
[ivy:retrieve] 	found commons-io#commons-io;2.6 in maven2
[ivy:retrieve] 	found org.apache.commons#commons-lang3;3.4 in maven2
[ivy:retrieve] 	found com.google.code.gson#gson;2.8.5 in maven2
[ivy:retrieve] 	found commons-collections#commons-collections;3.2.2 in maven2
[ivy:retrieve] 	found org.apache.commons#commons-compress;1.18 in maven2
[ivy:retrieve] 	found org.apache.commons#commons-text;1.3 in maven2
[ivy:retrieve] 	found org.apache.lucene#lucene-core;7.6.0 in maven2
[ivy:retrieve] 	found org.apache.lucene#lucene-analyzers-common;7.6.0 in maven2
[ivy:retrieve] 	found org.apache.lucene#lucene-queryparser;7.6.0 in maven2
[ivy:retrieve] 	found org.apache.lucene#lucene-queries;7.6.0 in maven2
[ivy:retrieve] 	found org.apache.lucene#lucene-sandbox;7.6.0 in maven2
[ivy:retrieve] 	found org.apache.velocity#velocity;1.7 in maven2
[ivy:retrieve] 	found commons-lang#commons-lang;2.4 in maven2
[ivy:retrieve] 	found org.glassfish#javax.json;1.0.4 in maven2
[ivy:retrieve] 	found org.jsoup#jsoup;1.11.3 in maven2
[ivy:retrieve] 	found com.sun.mail#mailapi;1.6.3 in maven2
[ivy:retrieve] 	found com.google.guava#guava;27.0.1-jre in maven2
[ivy:retrieve] 	found com.google.guava#failureaccess;1.0.1 in maven2
[ivy:retrieve] 	found com.google.guava#listenablefuture;9999.0-empty-to-avoid-conflict-with-guava
in maven2
[ivy:retrieve] 	found com.google.code.findbugs#jsr305;3.0.2 in maven2
[ivy:retrieve] 	found org.checkerframework#checker-qual;2.5.2 in maven2
[ivy:retrieve] 	found com.google.errorprone#error_prone_annotations;2.2.0 in maven2
[ivy:retrieve] 	found com.google.j2objc#j2objc-annotations;1.1 in maven2
[ivy:retrieve] 	found org.codehaus.mojo#animal-sniffer-annotations;1.17 in maven2
[ivy:retrieve] 	found com.h3xstream.retirejs#retirejs-core;3.0.1 in maven2
[ivy:retrieve] 	found org.json#json;20140107 in maven2
[ivy:retrieve] 	found com.esotericsoftware#minlog;1.3 in maven2
[ivy:retrieve] 	found com.github.spullara.mustache.java#compiler;0.8.17 in maven2
[ivy:retrieve] 	found com.h2database#h2;1.4.196 in maven2
[ivy:retrieve] :: resolution report :: resolve 998ms :: artifacts dl 17ms
	---------------------------------------------------------------------
	|                  |            modules            ||   artifacts   |
	|       conf       | number| search|dwnlded|evicted|| number|dwnlded|
	---------------------------------------------------------------------
	|       owasp      |   35  |   0   |   0   |   0   ||   35  |   0   |
	---------------------------------------------------------------------
[ivy:retrieve] :: retrieving :: org.apache.zookeeper#zookeeper
[ivy:retrieve] 	confs: [owasp]
[ivy:retrieve] 	35 artifacts copied, 0 already retrieved (15405kB/290ms)

owasp-taskdef:

ivy-retrieve:
[ivy:retrieve] :: resolving dependencies :: org.apache.zookeeper#zookeeper;3.6.0-SNAPSHOT
[ivy:retrieve] 	confs: [default]
[ivy:retrieve] 	found jline#jline;2.11 in maven2
[ivy:retrieve] 	found org.eclipse.jetty#jetty-server;9.4.15.v20190215 in maven2
[ivy:retrieve] 	found javax.servlet#javax.servlet-api;3.1.0 in maven2
[ivy:retrieve] 	found org.eclipse.jetty#jetty-http;9.4.15.v20190215 in maven2
[ivy:retrieve] 	found org.eclipse.jetty#jetty-util;9.4.15.v20190215 in maven2
[ivy:retrieve] 	found org.eclipse.jetty#jetty-io;9.4.15.v20190215 in maven2
[ivy:retrieve] 	found org.eclipse.jetty#jetty-servlet;9.4.15.v20190215 in maven2
[ivy:retrieve] 	found org.eclipse.jetty#jetty-security;9.4.15.v20190215 in maven2
[ivy:retrieve] 	found com.fasterxml.jackson.core#jackson-databind;2.9.9 in maven2
[ivy:retrieve] 	found com.fasterxml.jackson.core#jackson-annotations;2.9.0 in maven2
[ivy:retrieve] 	found com.fasterxml.jackson.core#jackson-core;2.9.9 in maven2
[ivy:retrieve] 	found org.slf4j#slf4j-api;1.7.25 in maven2
[ivy:retrieve] 	found org.slf4j#slf4j-log4j12;1.7.25 in maven2
[ivy:retrieve] 	found commons-cli#commons-cli;1.2 in maven2
[ivy:retrieve] 	found com.github.spotbugs#spotbugs-annotations;3.1.9 in maven2
[ivy:retrieve] 	found com.google.code.findbugs#jsr305;3.0.2 in maven2
[ivy:retrieve] 	found log4j#log4j;1.2.17 in maven2
[ivy:retrieve] 	found org.apache.yetus#audience-annotations;0.5.0 in maven2
[ivy:retrieve] 	found io.netty#netty-all;4.1.36.Final in maven2
[ivy:retrieve] 	found com.googlecode.json-simple#json-simple;1.1.1 in maven2
[ivy:retrieve] 	found commons-lang#commons-lang;2.6 in maven2
[ivy:retrieve] 	found org.xerial.snappy#snappy-java;1.1.7 in maven2
[ivy:retrieve] 	found io.dropwizard.metrics#metrics-core;3.2.5 in maven2
[ivy:retrieve] :: resolution report :: resolve 175ms :: artifacts dl 11ms
	---------------------------------------------------------------------
	|                  |            modules            ||   artifacts   |
	|       conf       | number| search|dwnlded|evicted|| number|dwnlded|
	---------------------------------------------------------------------
	|      default     |   23  |   0   |   0   |   0   ||   23  |   0   |
	---------------------------------------------------------------------
[ivy:retrieve] :: retrieving :: org.apache.zookeeper#zookeeper
[ivy:retrieve] 	confs: [default]
[ivy:retrieve] 	0 artifacts copied, 23 already retrieved (0kB/5ms)

owasp:
[owasp:dependency-check-update] Checking for updates
[owasp:dependency-check-update] starting getUpdatesNeeded() ...
[owasp:dependency-check-update] IO Exception connecting to https://nvd.nist.gov/feeds/xml/cve/2.0/nvdcve-2.0-2011.xml.gz:
connect timed out
[owasp:dependency-check-update] IO Exception connecting to https://nvd.nist.gov/feeds/xml/cve/2.0/nvdcve-2.0-2015.xml.gz:
connect timed out
[owasp:dependency-check-update] IO Exception connecting to https://nvd.nist.gov/feeds/xml/cve/2.0/nvdcve-2.0-2003.xml.gz:
connect timed out
[owasp:dependency-check-update] IO Exception connecting to https://nvd.nist.gov/feeds/xml/cve/2.0/nvdcve-2.0-2002.xml.gz:
connect timed out
[owasp:dependency-check-update] IO Exception connecting to https://nvd.nist.gov/feeds/xml/cve/2.0/nvdcve-2.0-2004.xml.gz:
connect timed out
[owasp:dependency-check-update] IO Exception connecting to https://nvd.nist.gov/feeds/xml/cve/2.0/nvdcve-2.0-2018.xml.gz:
connect timed out
[owasp:dependency-check-update] IO Exception connecting to https://nvd.nist.gov/feeds/xml/cve/2.0/nvdcve-2.0-2014.xml.gz:
connect timed out
[owasp:dependency-check-update] IO Exception connecting to https://nvd.nist.gov/feeds/xml/cve/2.0/nvdcve-2.0-2007.xml.gz:
connect timed out
[owasp:dependency-check-update] IO Exception connecting to https://nvd.nist.gov/feeds/xml/cve/2.0/nvdcve-2.0-Modified.xml.gz:
connect timed out
[owasp:dependency-check-update] Unable to download the NVD CVE data; the results may not include
the most recent CPE/CVEs from the NVD.
[owasp:dependency-check-update] If you are behind a proxy you may need to configure dependency-check
to use the proxy.
[owasp:dependency-check-update] IO Exception connecting to https://nvd.nist.gov/feeds/xml/cve/2.0/nvdcve-2.0-2010.xml.gz:
connect timed out
[owasp:dependency-check-update] IO Exception connecting to https://nvd.nist.gov/feeds/xml/cve/2.0/nvdcve-2.0-2006.xml.gz:
connect timed out
[owasp:dependency-check-update] IO Exception connecting to https://nvd.nist.gov/feeds/xml/cve/2.0/nvdcve-2.0-2009.xml.gz:
connect timed out
[owasp:dependency-check-update] IO Exception connecting to https://nvd.nist.gov/feeds/xml/cve/2.0/nvdcve-2.0-2012.xml.gz:
connect timed out
[owasp:dependency-check-update] IO Exception connecting to https://nvd.nist.gov/feeds/xml/cve/2.0/nvdcve-2.0-2013.xml.gz:
connect timed out
[owasp:dependency-check-update] IO Exception connecting to https://nvd.nist.gov/feeds/xml/cve/2.0/nvdcve-2.0-2005.xml.gz:
connect timed out
[owasp:dependency-check-update] IO Exception connecting to https://nvd.nist.gov/feeds/xml/cve/2.0/nvdcve-2.0-2016.xml.gz:
connect timed out
[owasp:dependency-check-update] IO Exception connecting to https://nvd.nist.gov/feeds/xml/cve/2.0/nvdcve-2.0-2008.xml.gz:
connect timed out
[owasp:dependency-check-update] IO Exception connecting to https://nvd.nist.gov/feeds/xml/cve/2.0/nvdcve-2.0-2019.xml.gz:
connect timed out
[owasp:dependency-check-update] IO Exception connecting to https://nvd.nist.gov/feeds/xml/cve/2.0/nvdcve-2.0-2017.xml.gz:
connect timed out

BUILD FAILED
<https://builds.apache.org/job/ZooKeeper-trunk-owasp/ws/build.xml>:1722: org.owasp.dependencycheck.data.update.exception.UpdateException:
Unable to download the NVD CVE data.
	at org.owasp.dependencycheck.data.update.NvdCveUpdater.update(NvdCveUpdater.java:135)
	at org.owasp.dependencycheck.Engine.doUpdates(Engine.java:899)
	at org.owasp.dependencycheck.Engine.doUpdates(Engine.java:871)
	at org.owasp.dependencycheck.taskdefs.Update.execute(Update.java:390)
	at org.apache.tools.ant.UnknownElement.execute(UnknownElement.java:292)
	at jdk.internal.reflect.GeneratedMethodAccessor6.invoke(Unknown Source)
	at java.base/jdk.internal.reflect.DelegatingMethodAccessorImpl.invoke(DelegatingMethodAccessorImpl.java:43)
	at java.base/java.lang.reflect.Method.invoke(Method.java:566)
	at org.apache.tools.ant.dispatch.DispatchUtils.execute(DispatchUtils.java:99)
	at org.apache.tools.ant.Task.perform(Task.java:350)
	at org.apache.tools.ant.Target.execute(Target.java:449)
	at org.apache.tools.ant.Target.performTasks(Target.java:470)
	at org.apache.tools.ant.Project.executeSortedTargets(Project.java:1391)
	at org.apache.tools.ant.Project.executeTarget(Project.java:1364)
	at org.apache.tools.ant.helper.DefaultExecutor.executeTargets(DefaultExecutor.java:41)
	at org.apache.tools.ant.Project.executeTargets(Project.java:1254)
	at org.apache.tools.ant.Main.runBuild(Main.java:830)
	at org.apache.tools.ant.Main.startAnt(Main.java:223)
	at org.apache.tools.ant.launch.Launcher.run(Launcher.java:284)
	at org.apache.tools.ant.launch.Launcher.main(Launcher.java:101)
Caused by: org.owasp.dependencycheck.utils.DownloadFailedException: java.util.concurrent.ExecutionException:
org.owasp.dependencycheck.utils.DownloadFailedException: Error making HTTP HEAD request to
https://nvd.nist.gov/feeds/xml/cve/2.0/nvdcve-2.0-2018.xml.gz
	at org.owasp.dependencycheck.data.update.NvdCveUpdater.retrieveLastModifiedDates(NvdCveUpdater.java:465)
	at org.owasp.dependencycheck.data.update.NvdCveUpdater.retrieveCurrentTimestampsFromWeb(NvdCveUpdater.java:407)
	at org.owasp.dependencycheck.data.update.NvdCveUpdater.getUpdatesNeeded(NvdCveUpdater.java:324)
	at org.owasp.dependencycheck.data.update.NvdCveUpdater.update(NvdCveUpdater.java:117)
	... 19 more
Caused by: java.util.concurrent.ExecutionException: org.owasp.dependencycheck.utils.DownloadFailedException:
Error making HTTP HEAD request to https://nvd.nist.gov/feeds/xml/cve/2.0/nvdcve-2.0-2018.xml.gz
	at java.base/java.util.concurrent.FutureTask.report(FutureTask.java:122)
	at java.base/java.util.concurrent.FutureTask.get(FutureTask.java:205)
	at org.owasp.dependencycheck.data.update.NvdCveUpdater.retrieveLastModifiedDates(NvdCveUpdater.java:460)
	... 22 more
Caused by: org.owasp.dependencycheck.utils.DownloadFailedException: Error making HTTP HEAD
request to https://nvd.nist.gov/feeds/xml/cve/2.0/nvdcve-2.0-2018.xml.gz
	at org.owasp.dependencycheck.utils.Downloader.getLastModified(Downloader.java:293)
	at org.owasp.dependencycheck.utils.Downloader.getLastModified(Downloader.java:235)
	at org.owasp.dependencycheck.data.update.NvdCveUpdater$TimestampRetriever.call(NvdCveUpdater.java:512)
	at org.owasp.dependencycheck.data.update.NvdCveUpdater$TimestampRetriever.call(NvdCveUpdater.java:485)
	at java.base/java.util.concurrent.FutureTask.run(FutureTask.java:264)
	at java.base/java.util.concurrent.ThreadPoolExecutor.runWorker(ThreadPoolExecutor.java:1128)
	at java.base/java.util.concurrent.ThreadPoolExecutor$Worker.run(ThreadPoolExecutor.java:628)
	at java.base/java.lang.Thread.run(Thread.java:834)
Caused by: java.net.SocketTimeoutException: connect timed out
	at java.base/java.net.PlainSocketImpl.socketConnect(Native Method)
	at java.base/java.net.AbstractPlainSocketImpl.doConnect(AbstractPlainSocketImpl.java:399)
	at java.base/java.net.AbstractPlainSocketImpl.connectToAddress(AbstractPlainSocketImpl.java:242)
	at java.base/java.net.AbstractPlainSocketImpl.connect(AbstractPlainSocketImpl.java:224)
	at java.base/java.net.Socket.connect(Socket.java:591)
	at java.base/sun.net.NetworkClient.doConnect(NetworkClient.java:177)
	at java.base/sun.net.www.http.HttpClient.openServer(HttpClient.java:474)
	at java.base/sun.net.www.http.HttpClient.openServer(HttpClient.java:569)
	at java.base/sun.net.www.protocol.https.HttpsClient.<init>(HttpsClient.java:265)
	at java.base/sun.net.www.protocol.https.HttpsClient.New(HttpsClient.java:372)
	at java.base/sun.net.www.protocol.https.AbstractDelegateHttpsURLConnection.getNewHttpClient(AbstractDelegateHttpsURLConnection.java:191)
	at java.base/sun.net.www.protocol.http.HttpURLConnection.plainConnect0(HttpURLConnection.java:1181)
	at java.base/sun.net.www.protocol.http.HttpURLConnection.plainConnect(HttpURLConnection.java:1075)
	at java.base/sun.net.www.protocol.https.AbstractDelegateHttpsURLConnection.connect(AbstractDelegateHttpsURLConnection.java:177)
	at java.base/sun.net.www.protocol.https.HttpsURLConnectionImpl.connect(HttpsURLConnectionImpl.java:163)
	at org.owasp.dependencycheck.utils.Downloader.getLastModified(Downloader.java:268)
	... 7 more

Total time: 31 seconds
Build step 'Invoke Ant' marked build as failure
Archiving artifacts

Mime
View raw message