zookeeper-dev mailing list archives

Site index · List index
Message view « Date » · « Thread »
Top « Date » · « Thread »
From Apache Jenkins Server <jenk...@builds.apache.org>
Subject Build failed in Jenkins: zookeeper-master-maven #316
Date Mon, 08 Jul 2019 22:29:26 GMT
See <https://builds.apache.org/job/zookeeper-master-maven/316/display/redirect?page=changes>

Changes:

[hanm] ZOOKEEPER-3243: Add server-side request throttling

------------------------------------------
[...truncated 474.55 KB...]
     [exec] ZooKeeper JMX enabled by default
     [exec] Using config: <https://builds.apache.org/job/zookeeper-master-maven/ws/zookeeper-client/zookeeper-client-c/../../build/test/test-cppunit/conf/2.conf>
     [exec] Stopping zookeeper ... STOPPED
     [exec] Stopping zookeeper ... STOPPED
     [exec] Stopping zookeeper ... STOPPED
     [exec]  : elapsed 7993 : OK
     [exec] ZooKeeper JMX enabled by default
     [exec] Using config: <https://builds.apache.org/job/zookeeper-master-maven/ws/zookeeper-client/zookeeper-client-c/../../build/test/test-cppunit/conf/0.conf>
     [exec] TestReconfigServer::testReconfigFailureWithoutServerSuperuserPasswordConfiguredStarting
zookeeper ... STARTED
     [exec] ZooKeeper JMX enabled by default
     [exec] Using config: <https://builds.apache.org/job/zookeeper-master-maven/ws/zookeeper-client/zookeeper-client-c/../../build/test/test-cppunit/conf/1.conf>
     [exec] ZooKeeper JMX enabled by default
     [exec] Using config: <https://builds.apache.org/job/zookeeper-master-maven/ws/zookeeper-client/zookeeper-client-c/../../build/test/test-cppunit/conf/2.conf>
     [exec] Starting zookeeper ... STARTED
     [exec] ZooKeeper JMX enabled by default
     [exec] Using config: <https://builds.apache.org/job/zookeeper-master-maven/ws/zookeeper-client/zookeeper-client-c/../../build/test/test-cppunit/conf/0.conf>
     [exec] Starting zookeeper ... STARTED
     [exec] ZooKeeper JMX enabled by default
     [exec] Using config: <https://builds.apache.org/job/zookeeper-master-maven/ws/zookeeper-client/zookeeper-client-c/../../build/test/test-cppunit/conf/1.conf>
     [exec] ZooKeeper JMX enabled by default
     [exec] Using config: <https://builds.apache.org/job/zookeeper-master-maven/ws/zookeeper-client/zookeeper-client-c/../../build/test/test-cppunit/conf/2.conf>
     [exec] ZooKeeper JMX enabled by default
     [exec] Using config: <https://builds.apache.org/job/zookeeper-master-maven/ws/zookeeper-client/zookeeper-client-c/../../build/test/test-cppunit/conf/0.conf>
     [exec] ZooKeeper JMX enabled by default
     [exec] Using config: <https://builds.apache.org/job/zookeeper-master-maven/ws/zookeeper-client/zookeeper-client-c/../../build/test/test-cppunit/conf/1.conf>
     [exec] Stopping zookeeper ... STOPPED
     [exec] Stopping zookeeper ... STOPPED
     [exec] ZooKeeper JMX enabled by default
     [exec] Using config: <https://builds.apache.org/job/zookeeper-master-maven/ws/zookeeper-client/zookeeper-client-c/../../build/test/test-cppunit/conf/2.conf>
     [exec] ZooKeeper JMX enabled by default
     [exec] Using config: <https://builds.apache.org/job/zookeeper-master-maven/ws/zookeeper-client/zookeeper-client-c/../../build/test/test-cppunit/conf/0.conf>
     [exec] Stopping zookeeper ... STOPPED
     [exec] Starting zookeeper ... STARTED
     [exec] ZooKeeper JMX enabled by default
     [exec] Using config: <https://builds.apache.org/job/zookeeper-master-maven/ws/zookeeper-client/zookeeper-client-c/../../build/test/test-cppunit/conf/1.conf>
     [exec] Starting zookeeper ... STARTED
     [exec] ZooKeeper JMX enabled by default
     [exec] Using config: <https://builds.apache.org/job/zookeeper-master-maven/ws/zookeeper-client/zookeeper-client-c/../../build/test/test-cppunit/conf/2.conf>
     [exec] Starting zookeeper ... STARTED
     [exec] ZooKeeper JMX enabled by default
     [exec] Using config: <https://builds.apache.org/job/zookeeper-master-maven/ws/zookeeper-client/zookeeper-client-c/../../build/test/test-cppunit/conf/0.conf>
     [exec] ZooKeeper JMX enabled by default
     [exec] Using config: <https://builds.apache.org/job/zookeeper-master-maven/ws/zookeeper-client/zookeeper-client-c/../../build/test/test-cppunit/conf/1.conf>
     [exec] ZooKeeper JMX enabled by default
     [exec] Using config: <https://builds.apache.org/job/zookeeper-master-maven/ws/zookeeper-client/zookeeper-client-c/../../build/test/test-cppunit/conf/2.conf>
     [exec] ZooKeeper JMX enabled by default
     [exec] Using config: <https://builds.apache.org/job/zookeeper-master-maven/ws/zookeeper-client/zookeeper-client-c/../../build/test/test-cppunit/conf/0.conf>
     [exec] ZooKeeper JMX enabled by default
     [exec] Using config: <https://builds.apache.org/job/zookeeper-master-maven/ws/zookeeper-client/zookeeper-client-c/../../build/test/test-cppunit/conf/1.conf>
     [exec] ZooKeeper JMX enabled by default
     [exec] Using config: <https://builds.apache.org/job/zookeeper-master-maven/ws/zookeeper-client/zookeeper-client-c/../../build/test/test-cppunit/conf/2.conf>
     [exec] ZooKeeper JMX enabled by default
     [exec] Using config: <https://builds.apache.org/job/zookeeper-master-maven/ws/zookeeper-client/zookeeper-client-c/../../build/test/test-cppunit/conf/0.conf>
     [exec] ZooKeeper JMX enabled by default
     [exec] Using config: <https://builds.apache.org/job/zookeeper-master-maven/ws/zookeeper-client/zookeeper-client-c/../../build/test/test-cppunit/conf/1.conf>
     [exec] ZooKeeper JMX enabled by default
     [exec] Using config: <https://builds.apache.org/job/zookeeper-master-maven/ws/zookeeper-client/zookeeper-client-c/../../build/test/test-cppunit/conf/0.conf>
     [exec] ZooKeeper JMX enabled by default
     [exec] Using config: <https://builds.apache.org/job/zookeeper-master-maven/ws/zookeeper-client/zookeeper-client-c/../../build/test/test-cppunit/conf/1.conf>
     [exec] ZooKeeper JMX enabled by default
     [exec] Using config: <https://builds.apache.org/job/zookeeper-master-maven/ws/zookeeper-client/zookeeper-client-c/../../build/test/test-cppunit/conf/2.conf>
     [exec] Stopping zookeeper ... STOPPED
     [exec] Stopping zookeeper ... STOPPED
     [exec] Stopping zookeeper ... STOPPED
     [exec]  : elapsed 12423 : OK
     [exec] Zookeeper_clientretry::testRetry ZooKeeper server started ZooKeeper server started
: elapsed 8181 : OK
     [exec] Zookeeper_operations::testAsyncWatcher1 : elapsed 5 : OK
     [exec] Zookeeper_operations::testAsyncGetOperation : elapsed 5 : OK
     [exec] Zookeeper_operations::testOperationsAndDisconnectConcurrently1 : elapsed 395 :
OK
     [exec] Zookeeper_operations::testOperationsAndDisconnectConcurrently2 : elapsed 0 : OK
     [exec] Zookeeper_operations::testConcurrentOperations1 : elapsed 22397 : OK
     [exec] Zookeeper_multi::testCreate : elapsed 1030 : OK
     [exec] Zookeeper_multi::testCreateDelete : elapsed 1012 : OK
     [exec] Zookeeper_multi::testInvalidVersion : elapsed 1010 : OK
     [exec] Zookeeper_multi::testNestedCreate : elapsed 1015 : OK
     [exec] Zookeeper_multi::testSetData : elapsed 6024 : OK
     [exec] Zookeeper_multi::testUpdateConflict : elapsed 1012 : OK
     [exec] Zookeeper_multi::testDeleteUpdateConflict : elapsed 1006 : OK
     [exec] Zookeeper_multi::testAsyncMulti : elapsed 2005 : OK
     [exec] Zookeeper_multi::testMultiFail : elapsed 1010 : OK
     [exec] Zookeeper_multi::testCheck : elapsed 1016 : OK
     [exec] Zookeeper_multi::testWatch : elapsed 2012 : OK
     [exec] Zookeeper_multi::testSequentialNodeCreateInAsyncMulti : elapsed 2001 : OK
     [exec] Zookeeper_multi::testBigAsyncMulti : elapsed 3004 : OK
     [exec] Zookeeper_watchers::testDefaultSessionWatcher1 : elapsed 53 : OK
     [exec] Zookeeper_watchers::testDefaultSessionWatcher2 : elapsed 5 : OK
     [exec] Zookeeper_watchers::testObjectSessionWatcher1 : elapsed 55 : OK
     [exec] Zookeeper_watchers::testObjectSessionWatcher2 : elapsed 57 : OK
     [exec] Zookeeper_watchers::testNodeWatcher1 : elapsed 57 : OK
     [exec] Zookeeper_watchers::testChildWatcher1 : elapsed 53 : OK
     [exec] Zookeeper_watchers::testChildWatcher2 : elapsed 54 : OK
     [exec] Zookeeper_simpleSystem::testLogCallbackSetLog Message Received: [2019-07-08 22:26:06,602:12781(0x7f05e4a6e740):ZOO_INFO@testLogCallbackSet@1010:
testLogCallbackSet #0]
     [exec] Log Message Received: [2019-07-08 22:26:06,602:12781(0x7f05e4a6e740):ZOO_INFO@testLogCallbackSet@1010:
testLogCallbackSet #1]
     [exec] Log Message Received: [2019-07-08 22:26:06,602:12781(0x7f05e4a6e740):ZOO_INFO@testLogCallbackSet@1010:
testLogCallbackSet #2]
     [exec] Log Message Received: [2019-07-08 22:26:06,602:12781(0x7f05e4a6e740):ZOO_INFO@testLogCallbackSet@1010:
testLogCallbackSet #3]
     [exec] Log Message Received: [2019-07-08 22:26:06,602:12781(0x7f05e4a6e740):ZOO_INFO@testLogCallbackSet@1010:
testLogCallbackSet #4]
     [exec] Log Message Received: [2019-07-08 22:26:06,602:12781(0x7f05e4a6e740):ZOO_INFO@testLogCallbackSet@1010:
testLogCallbackSet #5]
     [exec] Log Message Received: [2019-07-08 22:26:06,602:12781(0x7f05e4a6e740):ZOO_INFO@testLogCallbackSet@1010:
testLogCallbackSet #6]
     [exec] Log Message Received: [2019-07-08 22:26:06,602:12781(0x7f05e4a6e740):ZOO_INFO@testLogCallbackSet@1010:
testLogCallbackSet #7]
     [exec] Log Message Received: [2019-07-08 22:26:06,602:12781(0x7f05e4a6e740):ZOO_INFO@testLogCallbackSet@1010:
testLogCallbackSet #8]
     [exec] Log Message Received: [2019-07-08 22:26:06,602:12781(0x7f05e4a6e740):ZOO_INFO@testLogCallbackSet@1010:
testLogCallbackSet #9]
     [exec] Log Message Received: [2019-07-08 22:26:06,602:12781(0x7f05e4a6e740):ZOO_INFO@zookeeper_close@3255:
Closing zookeeper sessionId=0x1050854f13d000e to 127.0.0.1:22181
     [exec] ]
     [exec]  : elapsed 1001 : OK
     [exec] Zookeeper_simpleSystem::testLogCallbackInitLog Message Received: [2019-07-08 22:26:06,602:12781(0x7f05e4a6e740):ZOO_INFO@log_env@1098:
Client environment:zookeeper.version=zookeeper C client 3.6.0]
     [exec] Log Message Received: [2019-07-08 22:26:06,602:12781(0x7f05e4a6e740):ZOO_INFO@log_env@1102:
Client environment:host.name=asf915.gq1.ygridcore.net]
     [exec] Log Message Received: [2019-07-08 22:26:06,602:12781(0x7f05e4a6e740):ZOO_INFO@log_env@1109:
Client environment:os.name=Linux]
     [exec] Log Message Received: [2019-07-08 22:26:06,602:12781(0x7f05e4a6e740):ZOO_INFO@log_env@1110:
Client environment:os.arch=4.4.0-138-generic]
     [exec] Log Message Received: [2019-07-08 22:26:06,602:12781(0x7f05e4a6e740):ZOO_INFO@log_env@1111:
Client environment:os.version=#164-Ubuntu SMP Tue Oct 2 17:16:02 UTC 2018]
     [exec] Log Message Received: [2019-07-08 22:26:06,603:12781(0x7f05e4a6e740):ZOO_INFO@log_env@1119:
Client environment:user.name=jenkins]
     [exec] Log Message Received: [2019-07-08 22:26:06,603:12781(0x7f05e4a6e740):ZOO_INFO@log_env@1127:
Client environment:user.home=/home/jenkins]
     [exec] Log Message Received: [2019-07-08 22:26:06,603:12781(0x7f05e4a6e740):ZOO_INFO@log_env@1139:
Client environment:user.dir=<https://builds.apache.org/job/zookeeper-master-maven/ws/zookeeper-client/zookeeper-client-c/target/c]>
     [exec] Log Message Received: [2019-07-08 22:26:06,603:12781(0x7f05e4a6e740):ZOO_INFO@zookeeper_init_internal@1185:
Initiating client connection, host=127.0.0.1:22181 sessionTimeout=10000 watcher=0x45cf80 sessionId=0
sessionPasswd=<null> context=0x7ffccce02090 flags=0]
     [exec] Log Message Received: [2019-07-08 22:26:06,603:12781(0x7f05e1f61700):ZOO_INFO@check_events@2472:
initiated connection to server 127.0.0.1:22181]
     [exec] Log Message Received: [2019-07-08 22:26:06,607:12781(0x7f05e1f61700):ZOO_INFO@check_events@2524:
session establishment complete on server 127.0.0.1:22181, sessionId=0x1050854f13d000f, negotiated
timeout=10000 ]
     [exec] Log Message Received: [2019-07-08 22:26:07,603:12781(0x7f05e4a6e740):ZOO_INFO@testLogCallbackInit@1032:
testLogCallbackInit #0]
     [exec] Log Message Received: [2019-07-08 22:26:07,603:12781(0x7f05e4a6e740):ZOO_INFO@testLogCallbackInit@1032:
testLogCallbackInit #1]
     [exec] Log Message Received: [2019-07-08 22:26:07,603:12781(0x7f05e4a6e740):ZOO_INFO@testLogCallbackInit@1032:
testLogCallbackInit #2]
     [exec] Log Message Received: [2019-07-08 22:26:07,603:12781(0x7f05e4a6e740):ZOO_INFO@testLogCallbackInit@1032:
testLogCallbackInit #3]
     [exec] Log Message Received: [2019-07-08 22:26:07,603:12781(0x7f05e4a6e740):ZOO_INFO@testLogCallbackInit@1032:
testLogCallbackInit #4]
     [exec] Log Message Received: [2019-07-08 22:26:07,603:12781(0x7f05e4a6e740):ZOO_INFO@testLogCallbackInit@1032:
testLogCallbackInit #5]
     [exec] Log Message Received: [2019-07-08 22:26:07,603:12781(0x7f05e4a6e740):ZOO_INFO@testLogCallbackInit@1032:
testLogCallbackInit #6]
     [exec] Log Message Received: [2019-07-08 22:26:07,603:12781(0x7f05e4a6e740):ZOO_INFO@testLogCallbackInit@1032:
testLogCallbackInit #7]
     [exec] Log Message Received: [2019-07-08 22:26:07,603:12781(0x7f05e4a6e740):ZOO_INFO@testLogCallbackInit@1032:
testLogCallbackInit #8]
     [exec] Log Message Received: [2019-07-08 22:26:07,603:12781(0x7f05e4a6e740):ZOO_INFO@testLogCallbackInit@1032:
testLogCallbackInit #9]
     [exec] Log Message Received: [2019-07-08 22:26:07,604:12781(0x7f05e4a6e740):ZOO_INFO@zookeeper_close@3255:
Closing zookeeper sessionId=0x1050854f13d000f to 127.0.0.1:22181
     [exec] ]
     [exec]  : elapsed 1001 : OK
     [exec] Zookeeper_simpleSystem::testLogCallbackClearLog Message Received: [2019-07-08
22:26:07,604:12781(0x7f05e4a6e740):ZOO_INFO@log_env@1098: Client environment:zookeeper.version=zookeeper
C client 3.6.0]
     [exec] Log Message Received: [2019-07-08 22:26:07,604:12781(0x7f05e4a6e740):ZOO_INFO@log_env@1102:
Client environment:host.name=asf915.gq1.ygridcore.net]
     [exec] Log Message Received: [2019-07-08 22:26:07,604:12781(0x7f05e4a6e740):ZOO_INFO@log_env@1109:
Client environment:os.name=Linux]
     [exec] Log Message Received: [2019-07-08 22:26:07,604:12781(0x7f05e4a6e740):ZOO_INFO@log_env@1110:
Client environment:os.arch=4.4.0-138-generic]
     [exec] Log Message Received: [2019-07-08 22:26:07,604:12781(0x7f05e4a6e740):ZOO_INFO@log_env@1111:
Client environment:os.version=#164-Ubuntu SMP Tue Oct 2 17:16:02 UTC 2018]
     [exec] Log Message Received: [2019-07-08 22:26:07,604:12781(0x7f05e4a6e740):ZOO_INFO@log_env@1119:
Client environment:user.name=jenkins]
     [exec] Log Message Received: [2019-07-08 22:26:07,604:12781(0x7f05e4a6e740):ZOO_INFO@log_env@1127:
Client environment:user.home=/home/jenkins]
     [exec] Log Message Received: [2019-07-08 22:26:07,604:12781(0x7f05e4a6e740):ZOO_INFO@log_env@1139:
Client environment:user.dir=<https://builds.apache.org/job/zookeeper-master-maven/ws/zookeeper-client/zookeeper-client-c/target/c]>
     [exec] Log Message Received: [2019-07-08 22:26:07,604:12781(0x7f05e4a6e740):ZOO_INFO@zookeeper_init_internal@1185:
Initiating client connection, host=127.0.0.1:22181 sessionTimeout=10000 watcher=0x45cf80 sessionId=0
sessionPasswd=<null> context=0x7ffccce02130 flags=0]
     [exec] Log Message Received: [2019-07-08 22:26:07,605:12781(0x7f05e1760700):ZOO_INFO@check_events@2472:
initiated connection to server 127.0.0.1:22181]
     [exec] Log Message Received: [2019-07-08 22:26:07,616:12781(0x7f05e1760700):ZOO_INFO@check_events@2524:
session establishment complete on server 127.0.0.1:22181, sessionId=0x1050854f13d0010, negotiated
timeout=10000 ]
     [exec]  : elapsed 1001 : OK
     [exec] Zookeeper_simpleSystem::testAsyncWatcherAutoReset ZooKeeper server started : elapsed
11512 : OK
     [exec] Zookeeper_simpleSystem::testDeserializeString : elapsed 0 : OK
     [exec] Zookeeper_simpleSystem::testFirstServerDown : elapsed 1001 : OK
     [exec] Zookeeper_simpleSystem::testNonexistentHost : elapsed 1044 : OK
     [exec] Zookeeper_simpleSystem::testNullData : elapsed 1030 : OK
     [exec] Zookeeper_simpleSystem::testIPV6 : elapsed 1006 : OK
     [exec] Zookeeper_simpleSystem::testCreate : elapsed 1010 : OK
     [exec] Zookeeper_simpleSystem::testCreateContainer : elapsed 1006 : OK
     [exec] Zookeeper_simpleSystem::testCreateTtl : elapsed 2010 : OK
     [exec] Zookeeper_simpleSystem::testPath : elapsed 1015 : OK
     [exec] Zookeeper_simpleSystem::testPathValidation : elapsed 1043 : OK
     [exec] Zookeeper_simpleSystem::testPing : elapsed 17169 : OK
     [exec] Zookeeper_simpleSystem::testAcl : elapsed 1015 : OK
     [exec] Zookeeper_simpleSystem::testChroot : elapsed 3031 : OK
     [exec] Zookeeper_simpleSystem::testAuth ZooKeeper server started ZooKeeper server started
: elapsed 38155 : OK
     [exec] Zookeeper_simpleSystem::testHangingClient : elapsed 1028 : OK
     [exec] Zookeeper_simpleSystem::testWatcherAutoResetWithGlobal ZooKeeper server started
ZooKeeper server started ZooKeeper server started : elapsed 18478 : OK
     [exec] Zookeeper_simpleSystem::testWatcherAutoResetWithLocal ZooKeeper server started
ZooKeeper server started ZooKeeper server started : elapsed 17679 : OK
     [exec] Zookeeper_simpleSystem::testGetChildren2 : elapsed 1036 : OK
     [exec] Zookeeper_simpleSystem::testLastZxid : elapsed 4523 : OK
     [exec] Zookeeper_simpleSystem::testRemoveWatchers ZooKeeper server started : elapsed
12561 : OK
     [exec] Zookeeper_readOnly::testReadOnly : assertion : elapsed 9747
     [exec] Zookeeper_logClientEnv::testLogClientEnv : elapsed 2 : OK
     [exec] <https://builds.apache.org/job/zookeeper-master-maven/ws/zookeeper-client/zookeeper-client-c/tests/TestReadOnlyClient.cc>:99:
Assertion: equality assertion failed [Expected: 0, Actual  : -7]
     [exec] Failures !!!
     [exec] Run: 79   Failure total: 1   Failures: 1   Errors: 0
     [exec] FAIL: zktest-mt
     [exec] ==========================================
     [exec] 1 of 2 tests failed
     [exec] Please report to user@zookeeper.apache.org
     [exec] ==========================================
     [exec] Makefile:1782: recipe for target 'check-TESTS' failed
     [exec] make[1]: Leaving directory '<https://builds.apache.org/job/zookeeper-master-maven/ws/zookeeper-client/zookeeper-client-c/target/c'>
     [exec] Makefile:2038: recipe for target 'check-am' failed
     [exec] make[1]: *** [check-TESTS] Error 1
     [exec] make: *** [check-am] Error 2
[INFO] ------------------------------------------------------------------------
[INFO] Reactor Summary for Apache ZooKeeper 3.6.0-SNAPSHOT:
[INFO] 
[INFO] Apache ZooKeeper ................................... SUCCESS [ 16.912 s]
[INFO] Apache ZooKeeper - Documentation ................... SUCCESS [  8.733 s]
[INFO] Apache ZooKeeper - Jute ............................ SUCCESS [01:15 min]
[INFO] Apache ZooKeeper - Server .......................... SUCCESS [11:14 min]
[INFO] Apache ZooKeeper - Metrics Providers ............... SUCCESS [  3.221 s]
[INFO] Apache ZooKeeper - Prometheus.io Metrics Provider .. SUCCESS [ 17.770 s]
[INFO] Apache ZooKeeper - Client .......................... SUCCESS [  3.188 s]
[INFO] Apache ZooKeeper - Client - C ...................... FAILURE [06:04 min]
[INFO] Apache ZooKeeper - Recipes ......................... SKIPPED
[INFO] Apache ZooKeeper - Recipes - Election .............. SKIPPED
[INFO] Apache ZooKeeper - Recipes - Lock .................. SKIPPED
[INFO] Apache ZooKeeper - Recipes - Queue ................. SKIPPED
[INFO] Apache ZooKeeper - Assembly ........................ SKIPPED
[INFO] Apache ZooKeeper - Contrib ......................... SKIPPED
[INFO] Apache ZooKeeper - Contrib - Loggraph .............. SKIPPED
[INFO] Apache ZooKeeper - Contrib - Rest .................. SKIPPED
[INFO] Apache ZooKeeper - Contrib - ZooInspector .......... SKIPPED
[INFO] ------------------------------------------------------------------------
[INFO] BUILD FAILURE
[INFO] ------------------------------------------------------------------------
[INFO] Total time:  20:12 min
[INFO] Finished at: 2019-07-08T22:28:53Z
[INFO] ------------------------------------------------------------------------
Waiting for Jenkins to finish collecting data
[ERROR] Failed to execute goal org.apache.maven.plugins:maven-antrun-plugin:1.8:run (test-cppunit)
on project zookeeper-client-c: An Ant BuildException has occured: exec returned: 2
[ERROR] around Ant part ...<exec failonerror="true" dir="<https://builds.apache.org/job/zookeeper-master-maven/ws/zookeeper-client/zookeeper-client-c/target/c">
executable="make">... @ 4:158 in <https://builds.apache.org/job/zookeeper-master-maven/ws/zookeeper-client/zookeeper-client-c/target/antrun/build-main.xml>
[ERROR] -> [Help 1]
[ERROR] 
[ERROR] To see the full stack trace of the errors, re-run Maven with the -e switch.
[ERROR] Re-run Maven using the -X switch to enable full debug logging.
[ERROR] 
[ERROR] For more information about the errors and possible solutions, please read the following
articles:
[ERROR] [Help 1] http://cwiki.apache.org/confluence/display/MAVEN/MojoExecutionException
[ERROR] 
[ERROR] After correcting the problems, you can resume the build with the command
[ERROR]   mvn <goals> -rf :zookeeper-client-c
[JENKINS] Archiving <https://builds.apache.org/job/zookeeper-master-maven/ws/zookeeper-server/pom.xml>
to org.apache.zookeeper/zookeeper/3.6.0-SNAPSHOT/zookeeper-3.6.0-SNAPSHOT.pom
[JENKINS] Archiving <https://builds.apache.org/job/zookeeper-master-maven/ws/zookeeper-server/target/zookeeper-3.6.0-SNAPSHOT.jar>
to org.apache.zookeeper/zookeeper/3.6.0-SNAPSHOT/zookeeper-3.6.0-SNAPSHOT.jar
[JENKINS] Archiving <https://builds.apache.org/job/zookeeper-master-maven/ws/zookeeper-server/target/zookeeper-3.6.0-SNAPSHOT-tests.jar>
to org.apache.zookeeper/zookeeper/3.6.0-SNAPSHOT/zookeeper-3.6.0-SNAPSHOT-tests.jar
[JENKINS] Archiving <https://builds.apache.org/job/zookeeper-master-maven/ws/zookeeper-server/target/zookeeper-3.6.0-SNAPSHOT-sources.jar>
to org.apache.zookeeper/zookeeper/3.6.0-SNAPSHOT/zookeeper-3.6.0-SNAPSHOT-sources.jar
[JENKINS] Archiving <https://builds.apache.org/job/zookeeper-master-maven/ws/zookeeper-server/target/zookeeper-3.6.0-SNAPSHOT-javadoc.jar>
to org.apache.zookeeper/zookeeper/3.6.0-SNAPSHOT/zookeeper-3.6.0-SNAPSHOT-javadoc.jar
[JENKINS] Archiving <https://builds.apache.org/job/zookeeper-master-maven/ws/zookeeper-contrib/zookeeper-contrib-loggraph/pom.xml>
to org.apache.zookeeper/zookeeper-contrib-loggraph/3.6.0-SNAPSHOT/zookeeper-contrib-loggraph-3.6.0-SNAPSHOT.pom
[JENKINS] Archiving <https://builds.apache.org/job/zookeeper-master-maven/ws/zookeeper-metrics-providers/pom.xml>
to org.apache.zookeeper/zookeeper-metrics-providers/3.6.0-SNAPSHOT/zookeeper-metrics-providers-3.6.0-SNAPSHOT.pom
[JENKINS] Archiving <https://builds.apache.org/job/zookeeper-master-maven/ws/zookeeper-metrics-providers/zookeeper-prometheus-metrics/pom.xml>
to org.apache.zookeeper/zookeeper-prometheus-metrics/3.6.0-SNAPSHOT/zookeeper-prometheus-metrics-3.6.0-SNAPSHOT.pom
[JENKINS] Archiving <https://builds.apache.org/job/zookeeper-master-maven/ws/zookeeper-metrics-providers/zookeeper-prometheus-metrics/target/zookeeper-prometheus-metrics-3.6.0-SNAPSHOT.jar>
to org.apache.zookeeper/zookeeper-prometheus-metrics/3.6.0-SNAPSHOT/zookeeper-prometheus-metrics-3.6.0-SNAPSHOT.jar
[JENKINS] Archiving <https://builds.apache.org/job/zookeeper-master-maven/ws/zookeeper-metrics-providers/zookeeper-prometheus-metrics/target/zookeeper-prometheus-metrics-3.6.0-SNAPSHOT-tests.jar>
to org.apache.zookeeper/zookeeper-prometheus-metrics/3.6.0-SNAPSHOT/zookeeper-prometheus-metrics-3.6.0-SNAPSHOT-tests.jar
[JENKINS] Archiving <https://builds.apache.org/job/zookeeper-master-maven/ws/zookeeper-metrics-providers/zookeeper-prometheus-metrics/target/zookeeper-prometheus-metrics-3.6.0-SNAPSHOT-sources.jar>
to org.apache.zookeeper/zookeeper-prometheus-metrics/3.6.0-SNAPSHOT/zookeeper-prometheus-metrics-3.6.0-SNAPSHOT-sources.jar
[JENKINS] Archiving <https://builds.apache.org/job/zookeeper-master-maven/ws/zookeeper-metrics-providers/zookeeper-prometheus-metrics/target/zookeeper-prometheus-metrics-3.6.0-SNAPSHOT-javadoc.jar>
to org.apache.zookeeper/zookeeper-prometheus-metrics/3.6.0-SNAPSHOT/zookeeper-prometheus-metrics-3.6.0-SNAPSHOT-javadoc.jar
[JENKINS] Archiving <https://builds.apache.org/job/zookeeper-master-maven/ws/zookeeper-recipes/zookeeper-recipes-election/pom.xml>
to org.apache.zookeeper/zookeeper-recipes-election/3.6.0-SNAPSHOT/zookeeper-recipes-election-3.6.0-SNAPSHOT.pom
[JENKINS] Archiving <https://builds.apache.org/job/zookeeper-master-maven/ws/pom.xml>
to org.apache.zookeeper/parent/3.6.0-SNAPSHOT/parent-3.6.0-SNAPSHOT.pom
[JENKINS] Archiving <https://builds.apache.org/job/zookeeper-master-maven/ws/zookeeper-recipes/zookeeper-recipes-lock/pom.xml>
to org.apache.zookeeper/zookeeper-recipes-lock/3.6.0-SNAPSHOT/zookeeper-recipes-lock-3.6.0-SNAPSHOT.pom
[JENKINS] Archiving <https://builds.apache.org/job/zookeeper-master-maven/ws/zookeeper-contrib/pom.xml>
to org.apache.zookeeper/zookeeper-contrib/3.6.0-SNAPSHOT/zookeeper-contrib-3.6.0-SNAPSHOT.pom
[JENKINS] Archiving <https://builds.apache.org/job/zookeeper-master-maven/ws/zookeeper-client/pom.xml>
to org.apache.zookeeper/zookeeper-client/3.6.0-SNAPSHOT/zookeeper-client-3.6.0-SNAPSHOT.pom
[JENKINS] Archiving <https://builds.apache.org/job/zookeeper-master-maven/ws/zookeeper-jute/pom.xml>
to org.apache.zookeeper/zookeeper-jute/3.6.0-SNAPSHOT/zookeeper-jute-3.6.0-SNAPSHOT.pom
[JENKINS] Archiving <https://builds.apache.org/job/zookeeper-master-maven/ws/zookeeper-jute/target/zookeeper-jute-3.6.0-SNAPSHOT.jar>
to org.apache.zookeeper/zookeeper-jute/3.6.0-SNAPSHOT/zookeeper-jute-3.6.0-SNAPSHOT.jar
[JENKINS] Archiving <https://builds.apache.org/job/zookeeper-master-maven/ws/zookeeper-jute/target/zookeeper-jute-3.6.0-SNAPSHOT-tests.jar>
to org.apache.zookeeper/zookeeper-jute/3.6.0-SNAPSHOT/zookeeper-jute-3.6.0-SNAPSHOT-tests.jar
[JENKINS] Archiving <https://builds.apache.org/job/zookeeper-master-maven/ws/zookeeper-jute/target/zookeeper-jute-3.6.0-SNAPSHOT-sources.jar>
to org.apache.zookeeper/zookeeper-jute/3.6.0-SNAPSHOT/zookeeper-jute-3.6.0-SNAPSHOT-sources.jar
[JENKINS] Archiving <https://builds.apache.org/job/zookeeper-master-maven/ws/zookeeper-jute/target/zookeeper-jute-3.6.0-SNAPSHOT-javadoc.jar>
to org.apache.zookeeper/zookeeper-jute/3.6.0-SNAPSHOT/zookeeper-jute-3.6.0-SNAPSHOT-javadoc.jar
[JENKINS] Archiving <https://builds.apache.org/job/zookeeper-master-maven/ws/zookeeper-recipes/zookeeper-recipes-queue/pom.xml>
to org.apache.zookeeper/zookeeper-recipes-queue/3.6.0-SNAPSHOT/zookeeper-recipes-queue-3.6.0-SNAPSHOT.pom
[JENKINS] Archiving <https://builds.apache.org/job/zookeeper-master-maven/ws/zookeeper-docs/pom.xml>
to org.apache.zookeeper/zookeeper-docs/3.6.0-SNAPSHOT/zookeeper-docs-3.6.0-SNAPSHOT.pom
[JENKINS] Archiving <https://builds.apache.org/job/zookeeper-master-maven/ws/zookeeper-docs/target/zookeeper-docs-3.6.0-SNAPSHOT.jar>
to org.apache.zookeeper/zookeeper-docs/3.6.0-SNAPSHOT/zookeeper-docs-3.6.0-SNAPSHOT.jar
[JENKINS] Archiving <https://builds.apache.org/job/zookeeper-master-maven/ws/zookeeper-docs/target/zookeeper-docs-3.6.0-SNAPSHOT-tests.jar>
to org.apache.zookeeper/zookeeper-docs/3.6.0-SNAPSHOT/zookeeper-docs-3.6.0-SNAPSHOT-tests.jar
[JENKINS] Archiving <https://builds.apache.org/job/zookeeper-master-maven/ws/zookeeper-docs/target/zookeeper-docs-3.6.0-SNAPSHOT-sources.jar>
to org.apache.zookeeper/zookeeper-docs/3.6.0-SNAPSHOT/zookeeper-docs-3.6.0-SNAPSHOT-sources.jar
[JENKINS] Archiving <https://builds.apache.org/job/zookeeper-master-maven/ws/zookeeper-recipes/pom.xml>
to org.apache.zookeeper/zookeeper-recipes/3.6.0-SNAPSHOT/zookeeper-recipes-3.6.0-SNAPSHOT.pom
[JENKINS] Archiving <https://builds.apache.org/job/zookeeper-master-maven/ws/zookeeper-client/zookeeper-client-c/pom.xml>
to org.apache.zookeeper/zookeeper-client-c/3.6.0-SNAPSHOT/zookeeper-client-c-3.6.0-SNAPSHOT.pom
[JENKINS] Archiving <https://builds.apache.org/job/zookeeper-master-maven/ws/zookeeper-contrib/zookeeper-contrib-rest/pom.xml>
to org.apache.zookeeper/zookeeper-contrib-rest/3.6.0-SNAPSHOT/zookeeper-contrib-rest-3.6.0-SNAPSHOT.pom
[JENKINS] Archiving <https://builds.apache.org/job/zookeeper-master-maven/ws/zookeeper-assembly/pom.xml>
to org.apache.zookeeper/zookeeper-assembly/3.6.0-SNAPSHOT/zookeeper-assembly-3.6.0-SNAPSHOT.pom
[JENKINS] Archiving <https://builds.apache.org/job/zookeeper-master-maven/ws/zookeeper-contrib/zookeeper-contrib-zooinspector/pom.xml>
to org.apache.zookeeper/zookeeper-contrib-zooinspector/3.6.0-SNAPSHOT/zookeeper-contrib-zooinspector-3.6.0-SNAPSHOT.pom
channel stopped
[SpotBugs] Skipping execution of recorder since overall result is 'FAILURE'

Mime
View raw message