zookeeper-dev mailing list archives

Site index · List index
Message view « Date » · « Thread »
Top « Date » · « Thread »
From Apache Jenkins Server <jenk...@builds.apache.org>
Subject Build failed in Jenkins: PreCommit-ZOOKEEPER-github-pr-build-maven #940
Date Mon, 22 Jul 2019 10:18:20 GMT
See <https://builds.apache.org/job/PreCommit-ZOOKEEPER-github-pr-build-maven/940/display/redirect>

------------------------------------------
[...truncated 4.53 MB...]
[ERROR] target/classes/org/apache/jute/compiler/generated/SimpleCharStream.java:[298,37] (javadoc)
JavadocMethod: Expected @param tag for 'dstream'.
[ERROR] target/classes/org/apache/jute/compiler/generated/SimpleCharStream.java:[298,46] (misc)
FinalParameters: Parameter startline should be final.
[ERROR] target/classes/org/apache/jute/compiler/generated/SimpleCharStream.java:[298,50] (javadoc)
JavadocMethod: Expected @param tag for 'startline'.
[ERROR] target/classes/org/apache/jute/compiler/generated/SimpleCharStream.java:[299,3] (misc)
FinalParameters: Parameter startcolumn should be final.
[ERROR] target/classes/org/apache/jute/compiler/generated/SimpleCharStream.java:[299,7] (javadoc)
JavadocMethod: Expected @param tag for 'startcolumn'.
[ERROR] target/classes/org/apache/jute/compiler/generated/SimpleCharStream.java:[299,20] (misc)
FinalParameters: Parameter buffersize should be final.
[ERROR] target/classes/org/apache/jute/compiler/generated/SimpleCharStream.java:[299,24] (javadoc)
JavadocMethod: Expected @param tag for 'buffersize'.
[ERROR] target/classes/org/apache/jute/compiler/generated/SimpleCharStream.java:[300,3] (blocks)
LeftCurly: '{' at column 3 should be on the previous line.
[ERROR] target/classes/org/apache/jute/compiler/generated/SimpleCharStream.java:[306,5] (blocks)
LeftCurly: '{' at column 5 should be on the previous line.
[ERROR] target/classes/org/apache/jute/compiler/generated/SimpleCharStream.java:[307,27] (coding)
InnerAssignment: Inner assignments should be avoided.
[ERROR] target/classes/org/apache/jute/compiler/generated/SimpleCharStream.java:[312,33] (coding)
InnerAssignment: Inner assignments should be avoided.
[ERROR] target/classes/org/apache/jute/compiler/generated/SimpleCharStream.java:[313,24] (coding)
InnerAssignment: Inner assignments should be avoided.
[ERROR] target/classes/org/apache/jute/compiler/generated/SimpleCharStream.java:[313,41] (coding)
InnerAssignment: Inner assignments should be avoided.
[ERROR] target/classes/org/apache/jute/compiler/generated/SimpleCharStream.java:[318,15] (naming)
MethodName: Name 'ReInit' must match pattern '^[a-z][a-zA-Z0-9]*$'.
[ERROR] target/classes/org/apache/jute/compiler/generated/SimpleCharStream.java:[318,22] (misc)
FinalParameters: Parameter dstream should be final.
[ERROR] target/classes/org/apache/jute/compiler/generated/SimpleCharStream.java:[318,37] (javadoc)
JavadocMethod: Expected @param tag for 'dstream'.
[ERROR] target/classes/org/apache/jute/compiler/generated/SimpleCharStream.java:[318,46] (misc)
FinalParameters: Parameter startline should be final.
[ERROR] target/classes/org/apache/jute/compiler/generated/SimpleCharStream.java:[318,50] (javadoc)
JavadocMethod: Expected @param tag for 'startline'.
[ERROR] target/classes/org/apache/jute/compiler/generated/SimpleCharStream.java:[319,22] (misc)
FinalParameters: Parameter startcolumn should be final.
[ERROR] target/classes/org/apache/jute/compiler/generated/SimpleCharStream.java:[319,26] (javadoc)
JavadocMethod: Expected @param tag for 'startcolumn'.
[ERROR] target/classes/org/apache/jute/compiler/generated/SimpleCharStream.java:[320,3] (blocks)
LeftCurly: '{' at column 3 should be on the previous line.
[ERROR] target/classes/org/apache/jute/compiler/generated/SimpleCharStream.java:[321,45] (coding)
MagicNumber: '4096' is a magic number.
[ERROR] target/classes/org/apache/jute/compiler/generated/SimpleCharStream.java:[325,15] (naming)
MethodName: Name 'ReInit' must match pattern '^[a-z][a-zA-Z0-9]*$'.
[ERROR] target/classes/org/apache/jute/compiler/generated/SimpleCharStream.java:[325,22] (misc)
FinalParameters: Parameter dstream should be final.
[ERROR] target/classes/org/apache/jute/compiler/generated/SimpleCharStream.java:[325,37] (javadoc)
JavadocMethod: Expected @param tag for 'dstream'.
[ERROR] target/classes/org/apache/jute/compiler/generated/SimpleCharStream.java:[326,3] (blocks)
LeftCurly: '{' at column 3 should be on the previous line.
[ERROR] target/classes/org/apache/jute/compiler/generated/SimpleCharStream.java:[327,27] (coding)
MagicNumber: '4096' is a magic number.
[ERROR] target/classes/org/apache/jute/compiler/generated/SimpleCharStream.java:[330] (sizes)
LineLength: Line is longer than 80 characters (found 86).
[ERROR] target/classes/org/apache/jute/compiler/generated/SimpleCharStream.java:[330,27] (misc)
FinalParameters: Parameter dstream should be final.
[ERROR] target/classes/org/apache/jute/compiler/generated/SimpleCharStream.java:[330,47] (javadoc)
JavadocMethod: Expected @param tag for 'dstream'.
[ERROR] target/classes/org/apache/jute/compiler/generated/SimpleCharStream.java:[330,56] (misc)
FinalParameters: Parameter encoding should be final.
[ERROR] target/classes/org/apache/jute/compiler/generated/SimpleCharStream.java:[330,63] (javadoc)
JavadocMethod: Expected @param tag for 'encoding'.
[ERROR] target/classes/org/apache/jute/compiler/generated/SimpleCharStream.java:[330,73] (misc)
FinalParameters: Parameter startline should be final.
[ERROR] target/classes/org/apache/jute/compiler/generated/SimpleCharStream.java:[330,77] (javadoc)
JavadocMethod: Expected @param tag for 'startline'.
[ERROR] target/classes/org/apache/jute/compiler/generated/SimpleCharStream.java:[331,3] (misc)
FinalParameters: Parameter startcolumn should be final.
[ERROR] target/classes/org/apache/jute/compiler/generated/SimpleCharStream.java:[331,7] (javadoc)
JavadocMethod: Expected @param tag for 'startcolumn'.
[ERROR] target/classes/org/apache/jute/compiler/generated/SimpleCharStream.java:[331,20] (misc)
FinalParameters: Parameter buffersize should be final.
[ERROR] target/classes/org/apache/jute/compiler/generated/SimpleCharStream.java:[331,24] (javadoc)
JavadocMethod: Expected @param tag for 'buffersize'.
[ERROR] target/classes/org/apache/jute/compiler/generated/SimpleCharStream.java:[331,43] (javadoc)
JavadocMethod: Expected @throws tag for 'java.io.UnsupportedEncodingException'.
[ERROR] target/classes/org/apache/jute/compiler/generated/SimpleCharStream.java:[332,3] (blocks)
LeftCurly: '{' at column 3 should be on the previous line.
[ERROR] target/classes/org/apache/jute/compiler/generated/SimpleCharStream.java:[333] (sizes)
LineLength: Line is longer than 80 characters (found 155).
[ERROR] target/classes/org/apache/jute/compiler/generated/SimpleCharStream.java:[337,27] (misc)
FinalParameters: Parameter dstream should be final.
[ERROR] target/classes/org/apache/jute/compiler/generated/SimpleCharStream.java:[337,47] (javadoc)
JavadocMethod: Expected @param tag for 'dstream'.
[ERROR] target/classes/org/apache/jute/compiler/generated/SimpleCharStream.java:[337,56] (misc)
FinalParameters: Parameter startline should be final.
[ERROR] target/classes/org/apache/jute/compiler/generated/SimpleCharStream.java:[337,60] (javadoc)
JavadocMethod: Expected @param tag for 'startline'.
[ERROR] target/classes/org/apache/jute/compiler/generated/SimpleCharStream.java:[338,3] (misc)
FinalParameters: Parameter startcolumn should be final.
[ERROR] target/classes/org/apache/jute/compiler/generated/SimpleCharStream.java:[338,7] (javadoc)
JavadocMethod: Expected @param tag for 'startcolumn'.
[ERROR] target/classes/org/apache/jute/compiler/generated/SimpleCharStream.java:[338,20] (misc)
FinalParameters: Parameter buffersize should be final.
[ERROR] target/classes/org/apache/jute/compiler/generated/SimpleCharStream.java:[338,24] (javadoc)
JavadocMethod: Expected @param tag for 'buffersize'.
[ERROR] target/classes/org/apache/jute/compiler/generated/SimpleCharStream.java:[339,3] (blocks)
LeftCurly: '{' at column 3 should be on the previous line.
[ERROR] target/classes/org/apache/jute/compiler/generated/SimpleCharStream.java:[340] (sizes)
LineLength: Line is longer than 80 characters (found 85).
[ERROR] target/classes/org/apache/jute/compiler/generated/SimpleCharStream.java:[344] (sizes)
LineLength: Line is longer than 80 characters (found 86).
[ERROR] target/classes/org/apache/jute/compiler/generated/SimpleCharStream.java:[344,27] (misc)
FinalParameters: Parameter dstream should be final.
[ERROR] target/classes/org/apache/jute/compiler/generated/SimpleCharStream.java:[344,47] (javadoc)
JavadocMethod: Expected @param tag for 'dstream'.
[ERROR] target/classes/org/apache/jute/compiler/generated/SimpleCharStream.java:[344,56] (misc)
FinalParameters: Parameter encoding should be final.
[ERROR] target/classes/org/apache/jute/compiler/generated/SimpleCharStream.java:[344,63] (javadoc)
JavadocMethod: Expected @param tag for 'encoding'.
[ERROR] target/classes/org/apache/jute/compiler/generated/SimpleCharStream.java:[344,73] (misc)
FinalParameters: Parameter startline should be final.
[ERROR] target/classes/org/apache/jute/compiler/generated/SimpleCharStream.java:[344,77] (javadoc)
JavadocMethod: Expected @param tag for 'startline'.
[ERROR] target/classes/org/apache/jute/compiler/generated/SimpleCharStream.java:[345] (sizes)
LineLength: Line is longer than 80 characters (found 86).
[ERROR] target/classes/org/apache/jute/compiler/generated/SimpleCharStream.java:[345,27] (misc)
FinalParameters: Parameter startcolumn should be final.
[ERROR] target/classes/org/apache/jute/compiler/generated/SimpleCharStream.java:[345,31] (javadoc)
JavadocMethod: Expected @param tag for 'startcolumn'.
[ERROR] target/classes/org/apache/jute/compiler/generated/SimpleCharStream.java:[345,51] (javadoc)
JavadocMethod: Expected @throws tag for 'java.io.UnsupportedEncodingException'.
[ERROR] target/classes/org/apache/jute/compiler/generated/SimpleCharStream.java:[346,3] (blocks)
LeftCurly: '{' at column 3 should be on the previous line.
[ERROR] target/classes/org/apache/jute/compiler/generated/SimpleCharStream.java:[347,53] (coding)
MagicNumber: '4096' is a magic number.
[ERROR] target/classes/org/apache/jute/compiler/generated/SimpleCharStream.java:[351,27] (misc)
FinalParameters: Parameter dstream should be final.
[ERROR] target/classes/org/apache/jute/compiler/generated/SimpleCharStream.java:[351,47] (javadoc)
JavadocMethod: Expected @param tag for 'dstream'.
[ERROR] target/classes/org/apache/jute/compiler/generated/SimpleCharStream.java:[351,56] (misc)
FinalParameters: Parameter startline should be final.
[ERROR] target/classes/org/apache/jute/compiler/generated/SimpleCharStream.java:[351,60] (javadoc)
JavadocMethod: Expected @param tag for 'startline'.
[ERROR] target/classes/org/apache/jute/compiler/generated/SimpleCharStream.java:[352,27] (misc)
FinalParameters: Parameter startcolumn should be final.
[ERROR] target/classes/org/apache/jute/compiler/generated/SimpleCharStream.java:[352,31] (javadoc)
JavadocMethod: Expected @param tag for 'startcolumn'.
[ERROR] target/classes/org/apache/jute/compiler/generated/SimpleCharStream.java:[353,3] (blocks)
LeftCurly: '{' at column 3 should be on the previous line.
[ERROR] target/classes/org/apache/jute/compiler/generated/SimpleCharStream.java:[354,43] (coding)
MagicNumber: '4096' is a magic number.
[ERROR] target/classes/org/apache/jute/compiler/generated/SimpleCharStream.java:[358] (sizes)
LineLength: Line is longer than 80 characters (found 115).
[ERROR] target/classes/org/apache/jute/compiler/generated/SimpleCharStream.java:[358,27] (misc)
FinalParameters: Parameter dstream should be final.
[ERROR] target/classes/org/apache/jute/compiler/generated/SimpleCharStream.java:[358,47] (javadoc)
JavadocMethod: Expected @param tag for 'dstream'.
[ERROR] target/classes/org/apache/jute/compiler/generated/SimpleCharStream.java:[358,56] (misc)
FinalParameters: Parameter encoding should be final.
[ERROR] target/classes/org/apache/jute/compiler/generated/SimpleCharStream.java:[358,63] (javadoc)
JavadocMethod: Expected @param tag for 'encoding'.
[ERROR] target/classes/org/apache/jute/compiler/generated/SimpleCharStream.java:[358,80] (javadoc)
JavadocMethod: Expected @throws tag for 'java.io.UnsupportedEncodingException'.
[ERROR] target/classes/org/apache/jute/compiler/generated/SimpleCharStream.java:[359,3] (blocks)
LeftCurly: '{' at column 3 should be on the previous line.
[ERROR] target/classes/org/apache/jute/compiler/generated/SimpleCharStream.java:[360,35] (coding)
MagicNumber: '4096' is a magic number.
[ERROR] target/classes/org/apache/jute/compiler/generated/SimpleCharStream.java:[364,27] (misc)
FinalParameters: Parameter dstream should be final.
[ERROR] target/classes/org/apache/jute/compiler/generated/SimpleCharStream.java:[364,47] (javadoc)
JavadocMethod: Expected @param tag for 'dstream'.
[ERROR] target/classes/org/apache/jute/compiler/generated/SimpleCharStream.java:[365,3] (blocks)
LeftCurly: '{' at column 3 should be on the previous line.
[ERROR] target/classes/org/apache/jute/compiler/generated/SimpleCharStream.java:[366,25] (coding)
MagicNumber: '4096' is a magic number.
[ERROR] target/classes/org/apache/jute/compiler/generated/SimpleCharStream.java:[370] (sizes)
LineLength: Line is longer than 80 characters (found 81).
[ERROR] target/classes/org/apache/jute/compiler/generated/SimpleCharStream.java:[370,15] (naming)
MethodName: Name 'ReInit' must match pattern '^[a-z][a-zA-Z0-9]*$'.
[ERROR] target/classes/org/apache/jute/compiler/generated/SimpleCharStream.java:[370,22] (misc)
FinalParameters: Parameter dstream should be final.
[ERROR] target/classes/org/apache/jute/compiler/generated/SimpleCharStream.java:[370,42] (javadoc)
JavadocMethod: Expected @param tag for 'dstream'.
[ERROR] target/classes/org/apache/jute/compiler/generated/SimpleCharStream.java:[370,51] (misc)
FinalParameters: Parameter encoding should be final.
[ERROR] target/classes/org/apache/jute/compiler/generated/SimpleCharStream.java:[370,58] (javadoc)
JavadocMethod: Expected @param tag for 'encoding'.
[ERROR] target/classes/org/apache/jute/compiler/generated/SimpleCharStream.java:[370,68] (misc)
FinalParameters: Parameter startline should be final.
[ERROR] target/classes/org/apache/jute/compiler/generated/SimpleCharStream.java:[370,72] (javadoc)
JavadocMethod: Expected @param tag for 'startline'.
[ERROR] target/classes/org/apache/jute/compiler/generated/SimpleCharStream.java:[371] (sizes)
LineLength: Line is longer than 80 characters (found 102).
[ERROR] target/classes/org/apache/jute/compiler/generated/SimpleCharStream.java:[371,27] (misc)
FinalParameters: Parameter startcolumn should be final.
[ERROR] target/classes/org/apache/jute/compiler/generated/SimpleCharStream.java:[371,31] (javadoc)
JavadocMethod: Expected @param tag for 'startcolumn'.
[ERROR] target/classes/org/apache/jute/compiler/generated/SimpleCharStream.java:[371,44] (misc)
FinalParameters: Parameter buffersize should be final.
[ERROR] target/classes/org/apache/jute/compiler/generated/SimpleCharStream.java:[371,48] (javadoc)
JavadocMethod: Expected @param tag for 'buffersize'.
[ERROR] target/classes/org/apache/jute/compiler/generated/SimpleCharStream.java:[371,67] (javadoc)
JavadocMethod: Expected @throws tag for 'java.io.UnsupportedEncodingException'.
[ERROR] target/classes/org/apache/jute/compiler/generated/SimpleCharStream.java:[372,3] (blocks)
LeftCurly: '{' at column 3 should be on the previous line.
[ERROR] target/classes/org/apache/jute/compiler/generated/SimpleCharStream.java:[373] (sizes)
LineLength: Line is longer than 80 characters (found 157).
[ERROR] target/classes/org/apache/jute/compiler/generated/SimpleCharStream.java:[377,15] (naming)
MethodName: Name 'ReInit' must match pattern '^[a-z][a-zA-Z0-9]*$'.
[ERROR] target/classes/org/apache/jute/compiler/generated/SimpleCharStream.java:[377,22] (misc)
FinalParameters: Parameter dstream should be final.
[ERROR] target/classes/org/apache/jute/compiler/generated/SimpleCharStream.java:[377,42] (javadoc)
JavadocMethod: Expected @param tag for 'dstream'.
[ERROR] target/classes/org/apache/jute/compiler/generated/SimpleCharStream.java:[377,51] (misc)
FinalParameters: Parameter startline should be final.
[ERROR] target/classes/org/apache/jute/compiler/generated/SimpleCharStream.java:[377,55] (javadoc)
JavadocMethod: Expected @param tag for 'startline'.
[ERROR] target/classes/org/apache/jute/compiler/generated/SimpleCharStream.java:[378,27] (misc)
FinalParameters: Parameter startcolumn should be final.
[ERROR] target/classes/org/apache/jute/compiler/generated/SimpleCharStream.java:[378,31] (javadoc)
JavadocMethod: Expected @param tag for 'startcolumn'.
[ERROR] target/classes/org/apache/jute/compiler/generated/SimpleCharStream.java:[378,44] (misc)
FinalParameters: Parameter buffersize should be final.
[ERROR] target/classes/org/apache/jute/compiler/generated/SimpleCharStream.java:[378,48] (javadoc)
JavadocMethod: Expected @param tag for 'buffersize'.
[ERROR] target/classes/org/apache/jute/compiler/generated/SimpleCharStream.java:[379,3] (blocks)
LeftCurly: '{' at column 3 should be on the previous line.
[ERROR] target/classes/org/apache/jute/compiler/generated/SimpleCharStream.java:[380] (sizes)
LineLength: Line is longer than 80 characters (found 87).
[ERROR] target/classes/org/apache/jute/compiler/generated/SimpleCharStream.java:[384] (sizes)
LineLength: Line is longer than 80 characters (found 110).
[ERROR] target/classes/org/apache/jute/compiler/generated/SimpleCharStream.java:[384,15] (naming)
MethodName: Name 'ReInit' must match pattern '^[a-z][a-zA-Z0-9]*$'.
[ERROR] target/classes/org/apache/jute/compiler/generated/SimpleCharStream.java:[384,22] (misc)
FinalParameters: Parameter dstream should be final.
[ERROR] target/classes/org/apache/jute/compiler/generated/SimpleCharStream.java:[384,42] (javadoc)
JavadocMethod: Expected @param tag for 'dstream'.
[ERROR] target/classes/org/apache/jute/compiler/generated/SimpleCharStream.java:[384,51] (misc)
FinalParameters: Parameter encoding should be final.
[ERROR] target/classes/org/apache/jute/compiler/generated/SimpleCharStream.java:[384,58] (javadoc)
JavadocMethod: Expected @param tag for 'encoding'.
[ERROR] target/classes/org/apache/jute/compiler/generated/SimpleCharStream.java:[384,75] (javadoc)
JavadocMethod: Expected @throws tag for 'java.io.UnsupportedEncodingException'.
[ERROR] target/classes/org/apache/jute/compiler/generated/SimpleCharStream.java:[385,3] (blocks)
LeftCurly: '{' at column 3 should be on the previous line.
[ERROR] target/classes/org/apache/jute/compiler/generated/SimpleCharStream.java:[386,37] (coding)
MagicNumber: '4096' is a magic number.
[ERROR] target/classes/org/apache/jute/compiler/generated/SimpleCharStream.java:[390,15] (naming)
MethodName: Name 'ReInit' must match pattern '^[a-z][a-zA-Z0-9]*$'.
[ERROR] target/classes/org/apache/jute/compiler/generated/SimpleCharStream.java:[390,22] (misc)
FinalParameters: Parameter dstream should be final.
[ERROR] target/classes/org/apache/jute/compiler/generated/SimpleCharStream.java:[390,42] (javadoc)
JavadocMethod: Expected @param tag for 'dstream'.
[ERROR] target/classes/org/apache/jute/compiler/generated/SimpleCharStream.java:[391,3] (blocks)
LeftCurly: '{' at column 3 should be on the previous line.
[ERROR] target/classes/org/apache/jute/compiler/generated/SimpleCharStream.java:[392,27] (coding)
MagicNumber: '4096' is a magic number.
[ERROR] target/classes/org/apache/jute/compiler/generated/SimpleCharStream.java:[395] (sizes)
LineLength: Line is longer than 80 characters (found 81).
[ERROR] target/classes/org/apache/jute/compiler/generated/SimpleCharStream.java:[395,15] (naming)
MethodName: Name 'ReInit' must match pattern '^[a-z][a-zA-Z0-9]*$'.
[ERROR] target/classes/org/apache/jute/compiler/generated/SimpleCharStream.java:[395,22] (misc)
FinalParameters: Parameter dstream should be final.
[ERROR] target/classes/org/apache/jute/compiler/generated/SimpleCharStream.java:[395,42] (javadoc)
JavadocMethod: Expected @param tag for 'dstream'.
[ERROR] target/classes/org/apache/jute/compiler/generated/SimpleCharStream.java:[395,51] (misc)
FinalParameters: Parameter encoding should be final.
[ERROR] target/classes/org/apache/jute/compiler/generated/SimpleCharStream.java:[395,58] (javadoc)
JavadocMethod: Expected @param tag for 'encoding'.
[ERROR] target/classes/org/apache/jute/compiler/generated/SimpleCharStream.java:[395,68] (misc)
FinalParameters: Parameter startline should be final.
[ERROR] target/classes/org/apache/jute/compiler/generated/SimpleCharStream.java:[395,72] (javadoc)
JavadocMethod: Expected @param tag for 'startline'.
[ERROR] target/classes/org/apache/jute/compiler/generated/SimpleCharStream.java:[396] (sizes)
LineLength: Line is longer than 80 characters (found 81).
[ERROR] target/classes/org/apache/jute/compiler/generated/SimpleCharStream.java:[396,22] (misc)
FinalParameters: Parameter startcolumn should be final.
[ERROR] target/classes/org/apache/jute/compiler/generated/SimpleCharStream.java:[396,26] (javadoc)
JavadocMethod: Expected @param tag for 'startcolumn'.
[ERROR] target/classes/org/apache/jute/compiler/generated/SimpleCharStream.java:[396,46] (javadoc)
JavadocMethod: Expected @throws tag for 'java.io.UnsupportedEncodingException'.
[ERROR] target/classes/org/apache/jute/compiler/generated/SimpleCharStream.java:[397,3] (blocks)
LeftCurly: '{' at column 3 should be on the previous line.
[ERROR] target/classes/org/apache/jute/compiler/generated/SimpleCharStream.java:[398,55] (coding)
MagicNumber: '4096' is a magic number.
[ERROR] target/classes/org/apache/jute/compiler/generated/SimpleCharStream.java:[401,15] (naming)
MethodName: Name 'ReInit' must match pattern '^[a-z][a-zA-Z0-9]*$'.
[ERROR] target/classes/org/apache/jute/compiler/generated/SimpleCharStream.java:[401,22] (misc)
FinalParameters: Parameter dstream should be final.
[ERROR] target/classes/org/apache/jute/compiler/generated/SimpleCharStream.java:[401,42] (javadoc)
JavadocMethod: Expected @param tag for 'dstream'.
[ERROR] target/classes/org/apache/jute/compiler/generated/SimpleCharStream.java:[401,51] (misc)
FinalParameters: Parameter startline should be final.
[ERROR] target/classes/org/apache/jute/compiler/generated/SimpleCharStream.java:[401,55] (javadoc)
JavadocMethod: Expected @param tag for 'startline'.
[ERROR] target/classes/org/apache/jute/compiler/generated/SimpleCharStream.java:[402,22] (misc)
FinalParameters: Parameter startcolumn should be final.
[ERROR] target/classes/org/apache/jute/compiler/generated/SimpleCharStream.java:[402,26] (javadoc)
JavadocMethod: Expected @param tag for 'startcolumn'.
[ERROR] target/classes/org/apache/jute/compiler/generated/SimpleCharStream.java:[403,3] (blocks)
LeftCurly: '{' at column 3 should be on the previous line.
[ERROR] target/classes/org/apache/jute/compiler/generated/SimpleCharStream.java:[404,45] (coding)
MagicNumber: '4096' is a magic number.
[ERROR] target/classes/org/apache/jute/compiler/generated/SimpleCharStream.java:[407] (javadoc)
JavadocMethod: Expected @return tag.
[ERROR] target/classes/org/apache/jute/compiler/generated/SimpleCharStream.java:[407,17] (naming)
MethodName: Name 'GetImage' must match pattern '^[a-z][a-zA-Z0-9]*$'.
[ERROR] target/classes/org/apache/jute/compiler/generated/SimpleCharStream.java:[408,3] (blocks)
LeftCurly: '{' at column 3 should be on the previous line.
[ERROR] target/classes/org/apache/jute/compiler/generated/SimpleCharStream.java:[409] (blocks)
NeedBraces: 'if' construct must use '{}'s.
[ERROR] target/classes/org/apache/jute/compiler/generated/SimpleCharStream.java:[411] (blocks)
NeedBraces: 'else' construct must use '{}'s.
[ERROR] target/classes/org/apache/jute/compiler/generated/SimpleCharStream.java:[412,67] (whitespace)
OperatorWrap: '+' should be on a new line.
[ERROR] target/classes/org/apache/jute/compiler/generated/SimpleCharStream.java:[417] (javadoc)
JavadocMethod: Expected @return tag.
[ERROR] target/classes/org/apache/jute/compiler/generated/SimpleCharStream.java:[417,17] (naming)
MethodName: Name 'GetSuffix' must match pattern '^[a-z][a-zA-Z0-9]*$'.
[ERROR] target/classes/org/apache/jute/compiler/generated/SimpleCharStream.java:[417,27] (misc)
FinalParameters: Parameter len should be final.
[ERROR] target/classes/org/apache/jute/compiler/generated/SimpleCharStream.java:[417,31] (javadoc)
JavadocMethod: Expected @param tag for 'len'.
[ERROR] target/classes/org/apache/jute/compiler/generated/SimpleCharStream.java:[418,3] (blocks)
LeftCurly: '{' at column 3 should be on the previous line.
[ERROR] target/classes/org/apache/jute/compiler/generated/SimpleCharStream.java:[421] (blocks)
NeedBraces: 'if' construct must use '{}'s.
[ERROR] target/classes/org/apache/jute/compiler/generated/SimpleCharStream.java:[424,5] (blocks)
LeftCurly: '{' at column 5 should be on the previous line.
[ERROR] target/classes/org/apache/jute/compiler/generated/SimpleCharStream.java:[434,15] (naming)
MethodName: Name 'Done' must match pattern '^[a-z][a-zA-Z0-9]*$'.
[ERROR] target/classes/org/apache/jute/compiler/generated/SimpleCharStream.java:[435,3] (blocks)
LeftCurly: '{' at column 3 should be on the previous line.
[ERROR] target/classes/org/apache/jute/compiler/generated/SimpleCharStream.java:[444,37] (misc)
FinalParameters: Parameter newLine should be final.
[ERROR] target/classes/org/apache/jute/compiler/generated/SimpleCharStream.java:[444,41] (javadoc)
JavadocMethod: Expected @param tag for 'newLine'.
[ERROR] target/classes/org/apache/jute/compiler/generated/SimpleCharStream.java:[444,50] (misc)
FinalParameters: Parameter newCol should be final.
[ERROR] target/classes/org/apache/jute/compiler/generated/SimpleCharStream.java:[444,54] (javadoc)
JavadocMethod: Expected @param tag for 'newCol'.
[ERROR] target/classes/org/apache/jute/compiler/generated/SimpleCharStream.java:[445,3] (blocks)
LeftCurly: '{' at column 3 should be on the previous line.
[ERROR] target/classes/org/apache/jute/compiler/generated/SimpleCharStream.java:[450,5] (blocks)
LeftCurly: '{' at column 5 should be on the previous line.
[ERROR] target/classes/org/apache/jute/compiler/generated/SimpleCharStream.java:[452,5] (blocks)
RightCurly: '}' at column 5 should be on the same line as the next part of a multi-block statement
(one that directly contains multiple blocks: if/else-if/else, do/while or try/catch/finally).
[ERROR] target/classes/org/apache/jute/compiler/generated/SimpleCharStream.java:[454,5] (blocks)
LeftCurly: '{' at column 5 should be on the previous line.
[ERROR] target/classes/org/apache/jute/compiler/generated/SimpleCharStream.java:[458,5] (coding)
MultipleVariableDeclarations: Each variable declaration must be in its own statement.
[ERROR] target/classes/org/apache/jute/compiler/generated/SimpleCharStream.java:[459,5] (coding)
MultipleVariableDeclarations: Each variable declaration must be in its own statement.
[ERROR] target/classes/org/apache/jute/compiler/generated/SimpleCharStream.java:[461] (sizes)
LineLength: Line is longer than 80 characters (found 85).
[ERROR] target/classes/org/apache/jute/compiler/generated/SimpleCharStream.java:[461,33] (coding)
InnerAssignment: Inner assignments should be avoided.
[ERROR] target/classes/org/apache/jute/compiler/generated/SimpleCharStream.java:[461,65] (coding)
InnerAssignment: Inner assignments should be avoided.
[ERROR] target/classes/org/apache/jute/compiler/generated/SimpleCharStream.java:[462,5] (blocks)
LeftCurly: '{' at column 5 should be on the previous line.
[ERROR] target/classes/org/apache/jute/compiler/generated/SimpleCharStream.java:[471,5] (blocks)
LeftCurly: '{' at column 5 should be on the previous line.
[ERROR] target/classes/org/apache/jute/compiler/generated/SimpleCharStream.java:[476,7] (blocks)
LeftCurly: '{' at column 7 should be on the previous line.
[ERROR] target/classes/org/apache/jute/compiler/generated/SimpleCharStream.java:[477] (blocks)
NeedBraces: 'if' construct must use '{}'s.
[ERROR] target/classes/org/apache/jute/compiler/generated/SimpleCharStream.java:[477,23] (coding)
InnerAssignment: Inner assignments should be avoided.
[ERROR] target/classes/org/apache/jute/compiler/generated/SimpleCharStream.java:[479] (blocks)
NeedBraces: 'else' construct must use '{}'s.
[ERROR] target/classes/org/apache/jute/compiler/generated/SimpleCharStream.java:[489] (sizes)
LineLength: Line is longer than 80 characters (found 88).
[INFO] ------------------------------------------------------------------------
[INFO] Reactor Summary for Apache ZooKeeper 3.6.0-SNAPSHOT:
[INFO] 
[INFO] Apache ZooKeeper ................................... SUCCESS [ 23.186 s]
[INFO] Apache ZooKeeper - Documentation ................... SUCCESS [  8.745 s]
[INFO] Apache ZooKeeper - Jute ............................ FAILURE [01:16 min]
[INFO] Apache ZooKeeper - Server .......................... SKIPPED
[INFO] Apache ZooKeeper - Metrics Providers ............... SKIPPED
[INFO] Apache ZooKeeper - Prometheus.io Metrics Provider .. SKIPPED
[INFO] Apache ZooKeeper - Client .......................... SKIPPED
[INFO] Apache ZooKeeper - Client - C ...................... SKIPPED
[INFO] Apache ZooKeeper - Recipes ......................... SKIPPED
[INFO] Apache ZooKeeper - Recipes - Election .............. SKIPPED
[INFO] Apache ZooKeeper - Recipes - Lock .................. SKIPPED
[INFO] Apache ZooKeeper - Recipes - Queue ................. SKIPPED
[INFO] Apache ZooKeeper - Assembly ........................ SKIPPED
[INFO] Apache ZooKeeper - Contrib ......................... SKIPPED
[INFO] Apache ZooKeeper - Contrib - Loggraph .............. SKIPPED
[INFO] Apache ZooKeeper - Contrib - Rest .................. SKIPPED
[INFO] Apache ZooKeeper - Contrib - ZooInspector .......... SKIPPED
[INFO] ------------------------------------------------------------------------
[INFO] BUILD FAILURE
[INFO] ------------------------------------------------------------------------
[INFO] Total time:  02:19 min
[INFO] Finished at: 2019-07-22T10:17:43Z
[INFO] ------------------------------------------------------------------------
Waiting for Jenkins to finish collecting data
[ERROR] Failed to execute goal org.apache.maven.plugins:maven-checkstyle-plugin:3.0.0:check
(default-cli) on project zookeeper-jute: You have 12133 Checkstyle violations. -> [Help
1]
[ERROR] 
[ERROR] To see the full stack trace of the errors, re-run Maven with the -e switch.
[ERROR] Re-run Maven using the -X switch to enable full debug logging.
[ERROR] 
[ERROR] For more information about the errors and possible solutions, please read the following
articles:
[ERROR] [Help 1] http://cwiki.apache.org/confluence/display/MAVEN/MojoFailureException
[ERROR] 
[ERROR] After correcting the problems, you can resume the build with the command
[ERROR]   mvn <goals> -rf :zookeeper-jute
[JENKINS] Archiving <https://builds.apache.org/job/PreCommit-ZOOKEEPER-github-pr-build-maven/ws/zookeeper-server/pom.xml>
to org.apache.zookeeper/zookeeper/3.6.0-SNAPSHOT/zookeeper-3.6.0-SNAPSHOT.pom
[JENKINS] Archiving <https://builds.apache.org/job/PreCommit-ZOOKEEPER-github-pr-build-maven/ws/zookeeper-contrib/zookeeper-contrib-loggraph/pom.xml>
to org.apache.zookeeper/zookeeper-contrib-loggraph/3.6.0-SNAPSHOT/zookeeper-contrib-loggraph-3.6.0-SNAPSHOT.pom
[JENKINS] Archiving <https://builds.apache.org/job/PreCommit-ZOOKEEPER-github-pr-build-maven/ws/zookeeper-metrics-providers/pom.xml>
to org.apache.zookeeper/zookeeper-metrics-providers/3.6.0-SNAPSHOT/zookeeper-metrics-providers-3.6.0-SNAPSHOT.pom
[JENKINS] Archiving <https://builds.apache.org/job/PreCommit-ZOOKEEPER-github-pr-build-maven/ws/zookeeper-metrics-providers/zookeeper-prometheus-metrics/pom.xml>
to org.apache.zookeeper/zookeeper-prometheus-metrics/3.6.0-SNAPSHOT/zookeeper-prometheus-metrics-3.6.0-SNAPSHOT.pom
[JENKINS] Archiving <https://builds.apache.org/job/PreCommit-ZOOKEEPER-github-pr-build-maven/ws/zookeeper-recipes/zookeeper-recipes-election/pom.xml>
to org.apache.zookeeper/zookeeper-recipes-election/3.6.0-SNAPSHOT/zookeeper-recipes-election-3.6.0-SNAPSHOT.pom
[JENKINS] Archiving <https://builds.apache.org/job/PreCommit-ZOOKEEPER-github-pr-build-maven/ws/pom.xml>
to org.apache.zookeeper/parent/3.6.0-SNAPSHOT/parent-3.6.0-SNAPSHOT.pom
[JENKINS] Archiving <https://builds.apache.org/job/PreCommit-ZOOKEEPER-github-pr-build-maven/ws/zookeeper-recipes/zookeeper-recipes-lock/pom.xml>
to org.apache.zookeeper/zookeeper-recipes-lock/3.6.0-SNAPSHOT/zookeeper-recipes-lock-3.6.0-SNAPSHOT.pom
[JENKINS] Archiving <https://builds.apache.org/job/PreCommit-ZOOKEEPER-github-pr-build-maven/ws/zookeeper-contrib/pom.xml>
to org.apache.zookeeper/zookeeper-contrib/3.6.0-SNAPSHOT/zookeeper-contrib-3.6.0-SNAPSHOT.pom
[JENKINS] Archiving <https://builds.apache.org/job/PreCommit-ZOOKEEPER-github-pr-build-maven/ws/zookeeper-client/pom.xml>
to org.apache.zookeeper/zookeeper-client/3.6.0-SNAPSHOT/zookeeper-client-3.6.0-SNAPSHOT.pom
[JENKINS] Archiving <https://builds.apache.org/job/PreCommit-ZOOKEEPER-github-pr-build-maven/ws/zookeeper-jute/pom.xml>
to org.apache.zookeeper/zookeeper-jute/3.6.0-SNAPSHOT/zookeeper-jute-3.6.0-SNAPSHOT.pom
[JENKINS] Archiving <https://builds.apache.org/job/PreCommit-ZOOKEEPER-github-pr-build-maven/ws/zookeeper-jute/target/zookeeper-jute-3.6.0-SNAPSHOT.jar>
to org.apache.zookeeper/zookeeper-jute/3.6.0-SNAPSHOT/zookeeper-jute-3.6.0-SNAPSHOT.jar
[JENKINS] Archiving <https://builds.apache.org/job/PreCommit-ZOOKEEPER-github-pr-build-maven/ws/zookeeper-jute/target/zookeeper-jute-3.6.0-SNAPSHOT-tests.jar>
to org.apache.zookeeper/zookeeper-jute/3.6.0-SNAPSHOT/zookeeper-jute-3.6.0-SNAPSHOT-tests.jar
[JENKINS] Archiving <https://builds.apache.org/job/PreCommit-ZOOKEEPER-github-pr-build-maven/ws/zookeeper-jute/target/zookeeper-jute-3.6.0-SNAPSHOT-sources.jar>
to org.apache.zookeeper/zookeeper-jute/3.6.0-SNAPSHOT/zookeeper-jute-3.6.0-SNAPSHOT-sources.jar
[JENKINS] Archiving <https://builds.apache.org/job/PreCommit-ZOOKEEPER-github-pr-build-maven/ws/zookeeper-jute/target/zookeeper-jute-3.6.0-SNAPSHOT-javadoc.jar>
to org.apache.zookeeper/zookeeper-jute/3.6.0-SNAPSHOT/zookeeper-jute-3.6.0-SNAPSHOT-javadoc.jar
[JENKINS] Archiving <https://builds.apache.org/job/PreCommit-ZOOKEEPER-github-pr-build-maven/ws/zookeeper-recipes/zookeeper-recipes-queue/pom.xml>
to org.apache.zookeeper/zookeeper-recipes-queue/3.6.0-SNAPSHOT/zookeeper-recipes-queue-3.6.0-SNAPSHOT.pom
[JENKINS] Archiving <https://builds.apache.org/job/PreCommit-ZOOKEEPER-github-pr-build-maven/ws/zookeeper-docs/pom.xml>
to org.apache.zookeeper/zookeeper-docs/3.6.0-SNAPSHOT/zookeeper-docs-3.6.0-SNAPSHOT.pom
[JENKINS] Archiving <https://builds.apache.org/job/PreCommit-ZOOKEEPER-github-pr-build-maven/ws/zookeeper-docs/target/zookeeper-docs-3.6.0-SNAPSHOT.jar>
to org.apache.zookeeper/zookeeper-docs/3.6.0-SNAPSHOT/zookeeper-docs-3.6.0-SNAPSHOT.jar
[JENKINS] Archiving <https://builds.apache.org/job/PreCommit-ZOOKEEPER-github-pr-build-maven/ws/zookeeper-docs/target/zookeeper-docs-3.6.0-SNAPSHOT-tests.jar>
to org.apache.zookeeper/zookeeper-docs/3.6.0-SNAPSHOT/zookeeper-docs-3.6.0-SNAPSHOT-tests.jar
[JENKINS] Archiving <https://builds.apache.org/job/PreCommit-ZOOKEEPER-github-pr-build-maven/ws/zookeeper-docs/target/zookeeper-docs-3.6.0-SNAPSHOT-sources.jar>
to org.apache.zookeeper/zookeeper-docs/3.6.0-SNAPSHOT/zookeeper-docs-3.6.0-SNAPSHOT-sources.jar
[JENKINS] Archiving <https://builds.apache.org/job/PreCommit-ZOOKEEPER-github-pr-build-maven/ws/zookeeper-recipes/pom.xml>
to org.apache.zookeeper/zookeeper-recipes/3.6.0-SNAPSHOT/zookeeper-recipes-3.6.0-SNAPSHOT.pom
[JENKINS] Archiving <https://builds.apache.org/job/PreCommit-ZOOKEEPER-github-pr-build-maven/ws/zookeeper-client/zookeeper-client-c/pom.xml>
to org.apache.zookeeper/zookeeper-client-c/3.6.0-SNAPSHOT/zookeeper-client-c-3.6.0-SNAPSHOT.pom
[JENKINS] Archiving <https://builds.apache.org/job/PreCommit-ZOOKEEPER-github-pr-build-maven/ws/zookeeper-contrib/zookeeper-contrib-rest/pom.xml>
to org.apache.zookeeper/zookeeper-contrib-rest/3.6.0-SNAPSHOT/zookeeper-contrib-rest-3.6.0-SNAPSHOT.pom
[JENKINS] Archiving <https://builds.apache.org/job/PreCommit-ZOOKEEPER-github-pr-build-maven/ws/zookeeper-assembly/pom.xml>
to org.apache.zookeeper/zookeeper-assembly/3.6.0-SNAPSHOT/zookeeper-assembly-3.6.0-SNAPSHOT.pom
[JENKINS] Archiving <https://builds.apache.org/job/PreCommit-ZOOKEEPER-github-pr-build-maven/ws/zookeeper-contrib/zookeeper-contrib-zooinspector/pom.xml>
to org.apache.zookeeper/zookeeper-contrib-zooinspector/3.6.0-SNAPSHOT/zookeeper-contrib-zooinspector-3.6.0-SNAPSHOT.pom
channel stopped
[SpotBugs] Skipping execution of recorder since overall result is 'FAILURE'
Setting status of 05d994a09f12bd2e4ae2a3e3963c801685e19e21 to FAILURE with url https://builds.apache.org/job/PreCommit-ZOOKEEPER-github-pr-build-maven/940/
and message: 'FAILURE
 '
Using context: JenkinsMaven

Mime
View raw message