zookeeper-dev mailing list archives

Site index · List index
Message view « Date » · « Thread »
Top « Date » · « Thread »
From Apache Jenkins Server <jenk...@builds.apache.org>
Subject Build failed in Jenkins: zookeeper-master-maven-owasp #28
Date Mon, 08 Jul 2019 09:26:51 GMT
See <https://builds.apache.org/job/zookeeper-master-maven-owasp/28/display/redirect>

------------------------------------------
[...truncated 6.24 KB...]
[INFO] 
[INFO] >>> maven-source-plugin:3.0.1:jar (attach-sources) > generate-sources @
parent >>>
[INFO] 
[INFO] --- git-commit-id-plugin:2.2.5:revision (find-current-git-revision) @ parent ---
[INFO] 
[INFO] --- maven-antrun-plugin:1.8:run (default) @ parent ---
[INFO] Executing tasks

main:
[INFO] Executed tasks
[WARNING] Failed to getClass for org.apache.maven.plugins.source.SourceJarMojo
[INFO] 
[INFO] <<< maven-source-plugin:3.0.1:jar (attach-sources) < generate-sources @
parent <<<
[INFO] 
[INFO] 
[INFO] --- maven-source-plugin:3.0.1:jar (attach-sources) @ parent ---
[INFO] 
[INFO] --- maven-javadoc-plugin:3.0.1:jar (attach-javadocs) @ parent ---
[INFO] Not executing Javadoc as the project is not a Java classpath-capable package
[INFO] 
[INFO] --- dependency-check-maven:4.0.2:check (default-cli) @ parent ---
[INFO] Downloading from central: https://repo.maven.apache.org/maven2/org/owasp/dependency-check-core/4.0.2/dependency-check-core-4.0.2.pom
[INFO] Downloaded from central: https://repo.maven.apache.org/maven2/org/owasp/dependency-check-core/4.0.2/dependency-check-core-4.0.2.pom
(26 kB at 97 kB/s)
[INFO] Downloading from central: https://repo.maven.apache.org/maven2/com/vdurmont/semver4j/2.2.0/semver4j-2.2.0.pom
[INFO] Downloaded from central: https://repo.maven.apache.org/maven2/com/vdurmont/semver4j/2.2.0/semver4j-2.2.0.pom
(6.1 kB at 410 kB/s)
[INFO] Downloading from central: https://repo.maven.apache.org/maven2/joda-time/joda-time/1.6/joda-time-1.6.pom
[INFO] Downloaded from central: https://repo.maven.apache.org/maven2/joda-time/joda-time/1.6/joda-time-1.6.pom
(4.4 kB at 276 kB/s)
[INFO] Downloading from central: https://repo.maven.apache.org/maven2/org/owasp/dependency-check-utils/4.0.2/dependency-check-utils-4.0.2.pom
[INFO] Downloaded from central: https://repo.maven.apache.org/maven2/org/owasp/dependency-check-utils/4.0.2/dependency-check-utils-4.0.2.pom
(2.7 kB at 193 kB/s)
[INFO] Downloading from central: https://repo.maven.apache.org/maven2/org/apache/commons/commons-compress/1.18/commons-compress-1.18.pom
[INFO] Downloaded from central: https://repo.maven.apache.org/maven2/org/apache/commons/commons-compress/1.18/commons-compress-1.18.pom
(18 kB at 1.2 MB/s)
[INFO] Downloading from central: https://repo.maven.apache.org/maven2/org/apache/commons/commons-text/1.3/commons-text-1.3.pom
[INFO] Downloaded from central: https://repo.maven.apache.org/maven2/org/apache/commons/commons-text/1.3/commons-text-1.3.pom
(0 B at 0 B/s)
[INFO] Downloading from central: https://repo.maven.apache.org/maven2/org/apache/commons/commons-parent/45/commons-parent-45.pom
[INFO] Downloaded from central: https://repo.maven.apache.org/maven2/org/apache/commons/commons-parent/45/commons-parent-45.pom
(0 B at 0 B/s)
[INFO] Downloading from central: https://repo.maven.apache.org/maven2/org/apache/lucene/lucene-core/7.6.0/lucene-core-7.6.0.pom
[INFO] Downloaded from central: https://repo.maven.apache.org/maven2/org/apache/lucene/lucene-core/7.6.0/lucene-core-7.6.0.pom
(3.0 kB at 203 kB/s)
[INFO] Downloading from central: https://repo.maven.apache.org/maven2/org/apache/lucene/lucene-parent/7.6.0/lucene-parent-7.6.0.pom
[INFO] Downloaded from central: https://repo.maven.apache.org/maven2/org/apache/lucene/lucene-parent/7.6.0/lucene-parent-7.6.0.pom
(5.0 kB at 355 kB/s)
[INFO] Downloading from central: https://repo.maven.apache.org/maven2/org/apache/lucene/lucene-solr-grandparent/7.6.0/lucene-solr-grandparent-7.6.0.pom
[INFO] Downloaded from central: https://repo.maven.apache.org/maven2/org/apache/lucene/lucene-solr-grandparent/7.6.0/lucene-solr-grandparent-7.6.0.pom
(374 kB at 7.3 MB/s)
[INFO] Downloading from central: https://repo.maven.apache.org/maven2/org/apache/lucene/lucene-analyzers-common/7.6.0/lucene-analyzers-common-7.6.0.pom
[INFO] Downloaded from central: https://repo.maven.apache.org/maven2/org/apache/lucene/lucene-analyzers-common/7.6.0/lucene-analyzers-common-7.6.0.pom
(3.3 kB at 234 kB/s)
[INFO] Downloading from central: https://repo.maven.apache.org/maven2/org/apache/lucene/lucene-queryparser/7.6.0/lucene-queryparser-7.6.0.pom
[INFO] Downloaded from central: https://repo.maven.apache.org/maven2/org/apache/lucene/lucene-queryparser/7.6.0/lucene-queryparser-7.6.0.pom
(3.5 kB at 251 kB/s)
[INFO] Downloading from central: https://repo.maven.apache.org/maven2/org/apache/lucene/lucene-queries/7.6.0/lucene-queries-7.6.0.pom
[INFO] Downloaded from central: https://repo.maven.apache.org/maven2/org/apache/lucene/lucene-queries/7.6.0/lucene-queries-7.6.0.pom
(3.4 kB at 240 kB/s)
[INFO] Downloading from central: https://repo.maven.apache.org/maven2/org/apache/lucene/lucene-sandbox/7.6.0/lucene-sandbox-7.6.0.pom
[INFO] Downloaded from central: https://repo.maven.apache.org/maven2/org/apache/lucene/lucene-sandbox/7.6.0/lucene-sandbox-7.6.0.pom
(2.9 kB at 208 kB/s)
[INFO] Downloading from central: https://repo.maven.apache.org/maven2/com/h2database/h2/1.4.196/h2-1.4.196.pom
[INFO] Downloaded from central: https://repo.maven.apache.org/maven2/com/h2database/h2/1.4.196/h2-1.4.196.pom
(960 B at 69 kB/s)
[INFO] Downloading from central: https://repo.maven.apache.org/maven2/org/glassfish/javax.json/1.0.4/javax.json-1.0.4.pom
[INFO] Downloaded from central: https://repo.maven.apache.org/maven2/org/glassfish/javax.json/1.0.4/javax.json-1.0.4.pom
(9.2 kB at 543 kB/s)
[INFO] Downloading from central: https://repo.maven.apache.org/maven2/org/glassfish/json/1.0.4/json-1.0.4.pom
[INFO] Downloaded from central: https://repo.maven.apache.org/maven2/org/glassfish/json/1.0.4/json-1.0.4.pom
(11 kB at 615 kB/s)
[INFO] Downloading from central: https://repo.maven.apache.org/maven2/com/sun/mail/mailapi/1.6.3/mailapi-1.6.3.pom
[INFO] Downloaded from central: https://repo.maven.apache.org/maven2/com/sun/mail/mailapi/1.6.3/mailapi-1.6.3.pom
(6.2 kB at 362 kB/s)
[INFO] Downloading from central: https://repo.maven.apache.org/maven2/com/sun/mail/all/1.6.3/all-1.6.3.pom
[INFO] Downloaded from central: https://repo.maven.apache.org/maven2/com/sun/mail/all/1.6.3/all-1.6.3.pom
(25 kB at 1.6 MB/s)
[INFO] Downloading from central: https://repo.maven.apache.org/maven2/org/eclipse/ee4j/project/1.0.4/project-1.0.4.pom
[INFO] Downloaded from central: https://repo.maven.apache.org/maven2/org/eclipse/ee4j/project/1.0.4/project-1.0.4.pom
(12 kB at 828 kB/s)
[INFO] Downloading from central: https://repo.maven.apache.org/maven2/com/h3xstream/retirejs/retirejs-core/3.0.1/retirejs-core-3.0.1.pom
[INFO] Downloaded from central: https://repo.maven.apache.org/maven2/com/h3xstream/retirejs/retirejs-core/3.0.1/retirejs-core-3.0.1.pom
(1.6 kB at 83 kB/s)
[INFO] Downloading from central: https://repo.maven.apache.org/maven2/com/h3xstream/retirejs/retirejs-root-pom/3.0.1/retirejs-root-pom-3.0.1.pom
[INFO] Downloaded from central: https://repo.maven.apache.org/maven2/com/h3xstream/retirejs/retirejs-root-pom/3.0.1/retirejs-root-pom-3.0.1.pom
(8.9 kB at 557 kB/s)
[INFO] Downloading from central: https://repo.maven.apache.org/maven2/org/json/json/20140107/json-20140107.pom
[INFO] Downloaded from central: https://repo.maven.apache.org/maven2/org/json/json/20140107/json-20140107.pom
(4.2 kB at 262 kB/s)
[INFO] Downloading from central: https://repo.maven.apache.org/maven2/com/esotericsoftware/minlog/1.3/minlog-1.3.pom
[INFO] Downloaded from central: https://repo.maven.apache.org/maven2/com/esotericsoftware/minlog/1.3/minlog-1.3.pom
(4.3 kB at 285 kB/s)
[INFO] Downloading from central: https://repo.maven.apache.org/maven2/com/github/spullara/mustache/java/compiler/0.8.17/compiler-0.8.17.pom
[INFO] Downloaded from central: https://repo.maven.apache.org/maven2/com/github/spullara/mustache/java/compiler/0.8.17/compiler-0.8.17.pom
(4.2 kB at 261 kB/s)
[INFO] Downloading from central: https://repo.maven.apache.org/maven2/com/github/spullara/mustache/java/mustache.java/0.8.17/mustache.java-0.8.17.pom
[INFO] Downloaded from central: https://repo.maven.apache.org/maven2/com/github/spullara/mustache/java/mustache.java/0.8.17/mustache.java-0.8.17.pom
(3.7 kB at 215 kB/s)
[INFO] Downloading from central: https://repo.maven.apache.org/maven2/org/apache/maven/shared/maven-artifact-transfer/0.10.1/maven-artifact-transfer-0.10.1.pom
[INFO] Downloaded from central: https://repo.maven.apache.org/maven2/org/apache/maven/shared/maven-artifact-transfer/0.10.1/maven-artifact-transfer-0.10.1.pom
(11 kB at 545 kB/s)
[INFO] Downloading from central: https://repo.maven.apache.org/maven2/org/apache/maven/shared/maven-shared-components/33/maven-shared-components-33.pom
[INFO] Downloaded from central: https://repo.maven.apache.org/maven2/org/apache/maven/shared/maven-shared-components/33/maven-shared-components-33.pom
(5.1 kB at 364 kB/s)
[INFO] Downloading from central: https://repo.maven.apache.org/maven2/org/owasp/dependency-check-core/4.0.2/dependency-check-core-4.0.2.jar
[INFO] Downloading from central: https://repo.maven.apache.org/maven2/com/vdurmont/semver4j/2.2.0/semver4j-2.2.0.jar
[INFO] Downloading from central: https://repo.maven.apache.org/maven2/joda-time/joda-time/1.6/joda-time-1.6.jar
[INFO] Downloading from central: https://repo.maven.apache.org/maven2/org/apache/commons/commons-compress/1.18/commons-compress-1.18.jar
[INFO] Downloading from central: https://repo.maven.apache.org/maven2/org/apache/commons/commons-text/1.3/commons-text-1.3.jar
[INFO] Downloaded from central: https://repo.maven.apache.org/maven2/org/apache/commons/commons-text/1.3/commons-text-1.3.jar
(0 B at 0 B/s)
[INFO] Downloading from central: https://repo.maven.apache.org/maven2/org/apache/lucene/lucene-core/7.6.0/lucene-core-7.6.0.jar
[INFO] Downloaded from central: https://repo.maven.apache.org/maven2/com/vdurmont/semver4j/2.2.0/semver4j-2.2.0.jar
(27 kB at 542 kB/s)
[INFO] Downloading from central: https://repo.maven.apache.org/maven2/org/apache/lucene/lucene-analyzers-common/7.6.0/lucene-analyzers-common-7.6.0.jar
[INFO] Downloaded from central: https://repo.maven.apache.org/maven2/joda-time/joda-time/1.6/joda-time-1.6.jar
(535 kB at 7.9 MB/s)
[INFO] Downloading from central: https://repo.maven.apache.org/maven2/org/apache/lucene/lucene-queryparser/7.6.0/lucene-queryparser-7.6.0.jar
[INFO] Downloaded from central: https://repo.maven.apache.org/maven2/org/owasp/dependency-check-core/4.0.2/dependency-check-core-4.0.2.jar
(686 kB at 9.3 MB/s)
[INFO] Downloading from central: https://repo.maven.apache.org/maven2/org/apache/lucene/lucene-queries/7.6.0/lucene-queries-7.6.0.jar
[INFO] Downloaded from central: https://repo.maven.apache.org/maven2/org/apache/commons/commons-compress/1.18/commons-compress-1.18.jar
(592 kB at 7.5 MB/s)
[INFO] Downloading from central: https://repo.maven.apache.org/maven2/org/apache/lucene/lucene-sandbox/7.6.0/lucene-sandbox-7.6.0.jar
[INFO] Downloaded from central: https://repo.maven.apache.org/maven2/org/apache/lucene/lucene-queryparser/7.6.0/lucene-queryparser-7.6.0.jar
(382 kB at 3.9 MB/s)
[INFO] Downloading from central: https://repo.maven.apache.org/maven2/com/h2database/h2/1.4.196/h2-1.4.196.jar
[INFO] Downloaded from central: https://repo.maven.apache.org/maven2/org/apache/lucene/lucene-queries/7.6.0/lucene-queries-7.6.0.jar
(265 kB at 2.7 MB/s)
[INFO] Downloading from central: https://repo.maven.apache.org/maven2/org/glassfish/javax.json/1.0.4/javax.json-1.0.4.jar
[INFO] Downloaded from central: https://repo.maven.apache.org/maven2/org/apache/lucene/lucene-sandbox/7.6.0/lucene-sandbox-7.6.0.jar
(278 kB at 2.6 MB/s)
[INFO] Downloading from central: https://repo.maven.apache.org/maven2/com/sun/mail/mailapi/1.6.3/mailapi-1.6.3.jar
[INFO] Downloaded from central: https://repo.maven.apache.org/maven2/org/glassfish/javax.json/1.0.4/javax.json-1.0.4.jar
(85 kB at 698 kB/s)
[INFO] Downloading from central: https://repo.maven.apache.org/maven2/com/h3xstream/retirejs/retirejs-core/3.0.1/retirejs-core-3.0.1.jar
[INFO] Downloaded from central: https://repo.maven.apache.org/maven2/com/sun/mail/mailapi/1.6.3/mailapi-1.6.3.jar
(299 kB at 2.1 MB/s)
[INFO] Downloading from central: https://repo.maven.apache.org/maven2/org/json/json/20140107/json-20140107.jar
[INFO] Downloaded from central: https://repo.maven.apache.org/maven2/com/h3xstream/retirejs/retirejs-core/3.0.1/retirejs-core-3.0.1.jar
(27 kB at 191 kB/s)
[INFO] Downloading from central: https://repo.maven.apache.org/maven2/com/esotericsoftware/minlog/1.3/minlog-1.3.jar
[INFO] Downloaded from central: https://repo.maven.apache.org/maven2/com/esotericsoftware/minlog/1.3/minlog-1.3.jar
(5.6 kB at 36 kB/s)
[INFO] Downloading from central: https://repo.maven.apache.org/maven2/com/github/spullara/mustache/java/compiler/0.8.17/compiler-0.8.17.jar
[INFO] Downloaded from central: https://repo.maven.apache.org/maven2/org/json/json/20140107/json-20140107.jar
(65 kB at 409 kB/s)
[INFO] Downloading from central: https://repo.maven.apache.org/maven2/org/owasp/dependency-check-utils/4.0.2/dependency-check-utils-4.0.2.jar
[INFO] Downloaded from central: https://repo.maven.apache.org/maven2/org/owasp/dependency-check-utils/4.0.2/dependency-check-utils-4.0.2.jar
(38 kB at 214 kB/s)
[INFO] Downloading from central: https://repo.maven.apache.org/maven2/org/apache/maven/shared/maven-artifact-transfer/0.10.1/maven-artifact-transfer-0.10.1.jar
[INFO] Downloaded from central: https://repo.maven.apache.org/maven2/com/github/spullara/mustache/java/compiler/0.8.17/compiler-0.8.17.jar
(116 kB at 659 kB/s)
[INFO] Downloading from central: https://repo.maven.apache.org/maven2/org/apache/maven/maven-repository-metadata/3.1.0/maven-repository-metadata-3.1.0.jar
[INFO] Downloaded from central: https://repo.maven.apache.org/maven2/org/apache/lucene/lucene-analyzers-common/7.6.0/lucene-analyzers-common-7.6.0.jar
(1.7 MB at 9.0 MB/s)
[INFO] Downloading from central: https://repo.maven.apache.org/maven2/org/codehaus/plexus/plexus-classworlds/2.4.2/plexus-classworlds-2.4.2.jar
[INFO] Downloaded from central: https://repo.maven.apache.org/maven2/org/apache/maven/maven-repository-metadata/3.1.0/maven-repository-metadata-3.1.0.jar
(30 kB at 157 kB/s)
[INFO] Downloaded from central: https://repo.maven.apache.org/maven2/org/apache/maven/shared/maven-artifact-transfer/0.10.1/maven-artifact-transfer-0.10.1.jar
(128 kB at 659 kB/s)
[INFO] Downloaded from central: https://repo.maven.apache.org/maven2/com/h2database/h2/1.4.196/h2-1.4.196.jar
(1.8 MB at 9.1 MB/s)
[INFO] Downloaded from central: https://repo.maven.apache.org/maven2/org/codehaus/plexus/plexus-classworlds/2.4.2/plexus-classworlds-2.4.2.jar
(47 kB at 230 kB/s)
[INFO] Downloaded from central: https://repo.maven.apache.org/maven2/org/apache/lucene/lucene-core/7.6.0/lucene-core-7.6.0.jar
(3.1 MB at 13 MB/s)
[INFO] Central analyzer disabled
[INFO] Checking for updates
[INFO] starting getUpdatesNeeded() ...
[INFO] NVD CVE requires several updates; this could take a couple of minutes.
[INFO] Download Started for NVD CVE - 2002
[INFO] Download Started for NVD CVE - 2006
[INFO] Download Started for NVD CVE - 2008
[INFO] Download Started for NVD CVE - 2004
[INFO] Download Started for NVD CVE - 2005
[INFO] Download Started for NVD CVE - 2007
[INFO] Download Started for NVD CVE - 2009
[INFO] Download Started for NVD CVE - 2010
[INFO] Download Started for NVD CVE - 2003
[INFO] Download Started for NVD CVE - 2011
[INFO] Download Started for NVD CVE - 2012
[INFO] Download Started for NVD CVE - 2013
[INFO] Download Started for NVD CVE - 2014
[INFO] Download Started for NVD CVE - 2015
[INFO] Download Started for NVD CVE - 2016
[INFO] Download Started for NVD CVE - 2017
[INFO] Download Started for NVD CVE - 2018
[INFO] Download Started for NVD CVE - 2019
[INFO] Download Started for NVD CVE - Modified
[INFO] Download Complete for NVD CVE - 2003  (1923 ms)
[INFO] Processing Started for NVD CVE - 2003
[INFO] Download Complete for NVD CVE - 2005  (2304 ms)
[INFO] Processing Started for NVD CVE - 2005
[INFO] Download Complete for NVD CVE - 2004  (2404 ms)
[INFO] Processing Started for NVD CVE - 2004
[INFO] Download Complete for NVD CVE - Modified  (2484 ms)
[INFO] Processing Started for NVD CVE - Modified
[INFO] Download Complete for NVD CVE - 2002  (2682 ms)
[INFO] Processing Started for NVD CVE - 2002
[INFO] Download Complete for NVD CVE - 2007  (3055 ms)
[INFO] Download Complete for NVD CVE - 2009  (3129 ms)
[INFO] Processing Started for NVD CVE - 2007
[INFO] Processing Started for NVD CVE - 2009
[INFO] Download Complete for NVD CVE - 2008  (3330 ms)
[INFO] Processing Started for NVD CVE - 2008
[INFO] Download Complete for NVD CVE - 2014  (3566 ms)
[INFO] Processing Started for NVD CVE - 2014
[INFO] Download Complete for NVD CVE - 2012  (3723 ms)
[INFO] Download Complete for NVD CVE - 2013  (3729 ms)
[INFO] Processing Started for NVD CVE - 2013
[INFO] Processing Started for NVD CVE - 2012
[INFO] Download Complete for NVD CVE - 2006  (3861 ms)
[INFO] Download Complete for NVD CVE - 2010  (3903 ms)
[INFO] Processing Started for NVD CVE - 2010
[INFO] Processing Started for NVD CVE - 2006
[INFO] Download Complete for NVD CVE - 2016  (3953 ms)
[INFO] Processing Started for NVD CVE - 2016
[INFO] Download Complete for NVD CVE - 2015  (4378 ms)
[INFO] Download Complete for NVD CVE - 2011  (4408 ms)
[INFO] Processing Started for NVD CVE - 2011
[INFO] Processing Started for NVD CVE - 2015
[INFO] Download Complete for NVD CVE - 2019  (5074 ms)
[INFO] Processing Started for NVD CVE - 2019
[INFO] Download Complete for NVD CVE - 2017  (5805 ms)
[INFO] Processing Started for NVD CVE - 2017
[WARNING] Download Failed for NVD CVE - 2018
Some CVEs may not be reported.
[INFO] If you are behind a proxy you may need to configure dependency-check to use the proxy.
[WARNING] Unable to update Cached Web DataSource, using local data instead. Results may not
include recent vulnerabilities.
[INFO] Analysis Started
[INFO] Finished File Name Analyzer (0 seconds)
[INFO] Finished Dependency Merging Analyzer (0 seconds)
[INFO] Finished Version Filter Analyzer (0 seconds)
[INFO] Finished Hint Analyzer (0 seconds)
[INFO] Created CPE Index (0 seconds)
[INFO] Skipping CPE Analysis for npm
[INFO] Finished CPE Analyzer (0 seconds)
[INFO] Finished False Positive Analyzer (0 seconds)
[INFO] Finished NVD CVE Analyzer (0 seconds)
[INFO] Finished Vulnerability Suppression Analyzer (0 seconds)
[INFO] Finished Dependency Bundling Analyzer (0 seconds)
[INFO] Analysis Complete (0 seconds)
[INFO] ------------------------------------------------------------------------
[INFO] Reactor Summary for Apache ZooKeeper 3.6.0-SNAPSHOT:
[INFO] 
[INFO] Apache ZooKeeper ................................... FAILURE [ 23.235 s]
[INFO] Apache ZooKeeper - Documentation ................... SKIPPED
[INFO] Apache ZooKeeper - Jute ............................ SKIPPED
[INFO] Apache ZooKeeper - Server .......................... SKIPPED
[INFO] Apache ZooKeeper - Metrics Providers ............... SKIPPED
[INFO] Apache ZooKeeper - Prometheus.io Metrics Provider .. SKIPPED
[INFO] Apache ZooKeeper - Client .......................... SKIPPED
[INFO] Apache ZooKeeper - Recipes ......................... SKIPPED
[INFO] Apache ZooKeeper - Recipes - Election .............. SKIPPED
[INFO] Apache ZooKeeper - Recipes - Lock .................. SKIPPED
[INFO] Apache ZooKeeper - Recipes - Queue ................. SKIPPED
[INFO] Apache ZooKeeper - Assembly ........................ SKIPPED
[INFO] ------------------------------------------------------------------------
[INFO] BUILD FAILURE
[INFO] ------------------------------------------------------------------------
[INFO] Total time:  38.322 s
[INFO] Finished at: 2019-07-08T09:26:24Z
[INFO] ------------------------------------------------------------------------
Waiting for Jenkins to finish collecting data
[ERROR] Failed to execute goal org.owasp:dependency-check-maven:4.0.2:check (default-cli)
on project parent: One or more exceptions occurred during dependency-check analysis: One or
more exceptions occurred during dependency-check analysis
[ERROR] The download was interrupted; unable to complete the update
[ERROR] -> [Help 1]
[ERROR] 
[ERROR] To see the full stack trace of the errors, re-run Maven with the -e switch.
[ERROR] Re-run Maven using the -X switch to enable full debug logging.
[ERROR] 
[ERROR] For more information about the errors and possible solutions, please read the following
articles:
[ERROR] [Help 1] http://cwiki.apache.org/confluence/display/MAVEN/MojoExecutionException
[JENKINS] Archiving <https://builds.apache.org/job/zookeeper-master-maven-owasp/ws/zookeeper-server/pom.xml>
to org.apache.zookeeper/zookeeper/3.6.0-SNAPSHOT/zookeeper-3.6.0-SNAPSHOT.pom
[Fast Archiver] No prior successful build to compare, so performing full copy of artifacts
[JENKINS] Archiving <https://builds.apache.org/job/zookeeper-master-maven-owasp/ws/zookeeper-client/pom.xml>
to org.apache.zookeeper/zookeeper-client/3.6.0-SNAPSHOT/zookeeper-client-3.6.0-SNAPSHOT.pom
[Fast Archiver] No prior successful build to compare, so performing full copy of artifacts
[JENKINS] Archiving <https://builds.apache.org/job/zookeeper-master-maven-owasp/ws/zookeeper-jute/pom.xml>
to org.apache.zookeeper/zookeeper-jute/3.6.0-SNAPSHOT/zookeeper-jute-3.6.0-SNAPSHOT.pom
[JENKINS] Archiving <https://builds.apache.org/job/zookeeper-master-maven-owasp/ws/zookeeper-metrics-providers/pom.xml>
to org.apache.zookeeper/zookeeper-metrics-providers/3.6.0-SNAPSHOT/zookeeper-metrics-providers-3.6.0-SNAPSHOT.pom
[Fast Archiver] No prior successful build to compare, so performing full copy of artifacts
[JENKINS] Archiving <https://builds.apache.org/job/zookeeper-master-maven-owasp/ws/zookeeper-metrics-providers/zookeeper-prometheus-metrics/pom.xml>
to org.apache.zookeeper/zookeeper-prometheus-metrics/3.6.0-SNAPSHOT/zookeeper-prometheus-metrics-3.6.0-SNAPSHOT.pom
[Fast Archiver] No prior successful build to compare, so performing full copy of artifacts
[JENKINS] Archiving <https://builds.apache.org/job/zookeeper-master-maven-owasp/ws/zookeeper-recipes/zookeeper-recipes-election/pom.xml>
to org.apache.zookeeper/zookeeper-recipes-election/3.6.0-SNAPSHOT/zookeeper-recipes-election-3.6.0-SNAPSHOT.pom
[Fast Archiver] No prior successful build to compare, so performing full copy of artifacts
[JENKINS] Archiving <https://builds.apache.org/job/zookeeper-master-maven-owasp/ws/zookeeper-recipes/zookeeper-recipes-queue/pom.xml>
to org.apache.zookeeper/zookeeper-recipes-queue/3.6.0-SNAPSHOT/zookeeper-recipes-queue-3.6.0-SNAPSHOT.pom
[Fast Archiver] No prior successful build to compare, so performing full copy of artifacts
[JENKINS] Archiving <https://builds.apache.org/job/zookeeper-master-maven-owasp/ws/zookeeper-docs/pom.xml>
to org.apache.zookeeper/zookeeper-docs/3.6.0-SNAPSHOT/zookeeper-docs-3.6.0-SNAPSHOT.pom
[JENKINS] Archiving <https://builds.apache.org/job/zookeeper-master-maven-owasp/ws/zookeeper-recipes/pom.xml>
to org.apache.zookeeper/zookeeper-recipes/3.6.0-SNAPSHOT/zookeeper-recipes-3.6.0-SNAPSHOT.pom
[Fast Archiver] No prior successful build to compare, so performing full copy of artifacts
[JENKINS] Archiving <https://builds.apache.org/job/zookeeper-master-maven-owasp/ws/pom.xml>
to org.apache.zookeeper/parent/3.6.0-SNAPSHOT/parent-3.6.0-SNAPSHOT.pom
[JENKINS] Archiving <https://builds.apache.org/job/zookeeper-master-maven-owasp/ws/zookeeper-recipes/zookeeper-recipes-lock/pom.xml>
to org.apache.zookeeper/zookeeper-recipes-lock/3.6.0-SNAPSHOT/zookeeper-recipes-lock-3.6.0-SNAPSHOT.pom
[Fast Archiver] No prior successful build to compare, so performing full copy of artifacts
[JENKINS] Archiving <https://builds.apache.org/job/zookeeper-master-maven-owasp/ws/zookeeper-assembly/pom.xml>
to org.apache.zookeeper/zookeeper-assembly/3.6.0-SNAPSHOT/zookeeper-assembly-3.6.0-SNAPSHOT.pom
[Fast Archiver] No prior successful build to compare, so performing full copy of artifacts
channel stopped
[SpotBugs] Skipping execution of recorder since overall result is 'FAILURE'

Mime
View raw message