zookeeper-dev mailing list archives

Site index · List index
Message view « Date » · « Thread »
Top « Date » · « Thread »
From Apache Jenkins Server <jenk...@builds.apache.org>
Subject ZooKeeper-trunk - Build # 611 - Failure
Date Fri, 12 Jul 2019 07:23:14 GMT
See https://builds.apache.org/job/ZooKeeper-trunk/611/

###################################################################################
########################## LAST 60 LINES OF THE CONSOLE ###########################
[...truncated 316.73 KB...]
     [exec] ZooKeeper JMX enabled by default
     [exec] Starting zookeeper ... STARTED
     [exec] Using config: /home/jenkins/jenkins-slave/workspace/ZooKeeper-trunk/zookeeper-client/zookeeper-client-c/../../build/test/test-cppunit/conf/2.conf
     [exec] Starting zookeeper ... STARTED
     [exec] ZooKeeper JMX enabled by default
     [exec] Using config: /home/jenkins/jenkins-slave/workspace/ZooKeeper-trunk/zookeeper-client/zookeeper-client-c/../../build/test/test-cppunit/conf/0.conf
     [exec] ZooKeeper JMX enabled by default
     [exec] Using config: /home/jenkins/jenkins-slave/workspace/ZooKeeper-trunk/zookeeper-client/zookeeper-client-c/../../build/test/test-cppunit/conf/1.conf
     [exec] ZooKeeper JMX enabled by default
     [exec] Using config: /home/jenkins/jenkins-slave/workspace/ZooKeeper-trunk/zookeeper-client/zookeeper-client-c/../../build/test/test-cppunit/conf/2.conf
     [exec] ZooKeeper JMX enabled by default
     [exec] Using config: /home/jenkins/jenkins-slave/workspace/ZooKeeper-trunk/zookeeper-client/zookeeper-client-c/../../build/test/test-cppunit/conf/0.conf
     [exec] ZooKeeper JMX enabled by default
     [exec] Using config: /home/jenkins/jenkins-slave/workspace/ZooKeeper-trunk/zookeeper-client/zookeeper-client-c/../../build/test/test-cppunit/conf/1.conf
     [exec] ZooKeeper JMX enabled by default
     [exec] Using config: /home/jenkins/jenkins-slave/workspace/ZooKeeper-trunk/zookeeper-client/zookeeper-client-c/../../build/test/test-cppunit/conf/2.conf
     [exec] ZooKeeper JMX enabled by default
     [exec] Using config: /home/jenkins/jenkins-slave/workspace/ZooKeeper-trunk/zookeeper-client/zookeeper-client-c/../../build/test/test-cppunit/conf/0.conf
     [exec] ZooKeeper JMX enabled by default
     [exec] Using config: /home/jenkins/jenkins-slave/workspace/ZooKeeper-trunk/zookeeper-client/zookeeper-client-c/../../build/test/test-cppunit/conf/1.conf
     [exec] Stopping zookeeper ... STOPPED
     [exec] ZooKeeper JMX enabled by default
     [exec] Using config: /home/jenkins/jenkins-slave/workspace/ZooKeeper-trunk/zookeeper-client/zookeeper-client-c/../../build/test/test-cppunit/conf/0.conf
     [exec] Stopping zookeeper ... STOPPED
     [exec] Stopping zookeeper ... STOPPED
     [exec]  : elapsed 11846 : OK
     [exec] ZooKeeper JMX enabled by default
     [exec] Using config: /home/jenkins/jenkins-slave/workspace/ZooKeeper-trunk/zookeeper-client/zookeeper-client-c/../../build/test/test-cppunit/conf/1.conf
     [exec] ZooKeeper JMX enabled by default
     [exec] Using config: /home/jenkins/jenkins-slave/workspace/ZooKeeper-trunk/zookeeper-client/zookeeper-client-c/../../build/test/test-cppunit/conf/2.conf
     [exec] Zookeeper_clientretry::testRetry ZooKeeper server started ZooKeeper server started
: elapsed 7881 : OK
     [exec] Zookeeper_operations::testAsyncWatcher1 : elapsed 5 : OK
     [exec] Zookeeper_operations::testAsyncGetOperation : elapsed 5 : OK
     [exec] Zookeeper_operations::testOperationsAndDisconnectConcurrently1FAIL: zktest-mt
     [exec] ==========================================
     [exec] 1 of 2 tests failed
     [exec] Please report to user@zookeeper.apache.org
     [exec] ==========================================
     [exec] Makefile:1782: recipe for target 'check-TESTS' failed
     [exec] make[1]: Leaving directory '/home/jenkins/jenkins-slave/workspace/ZooKeeper-trunk/build/test/test-cppunit'
     [exec] Makefile:2038: recipe for target 'check-am' failed
     [exec] /bin/bash: line 5: 31016 Segmentation fault      ZKROOT=/home/jenkins/jenkins-slave/workspace/ZooKeeper-trunk/zookeeper-client/zookeeper-client-c/../..
CLASSPATH=$CLASSPATH:$CLOVER_HOME/lib/clover*.jar ${dir}$tst
     [exec] make[1]: *** [check-TESTS] Error 1
     [exec] make: *** [check-am] Error 2

BUILD FAILED
/home/jenkins/jenkins-slave/workspace/ZooKeeper-trunk/build.xml:1492: The following error
occurred while executing this line:
/home/jenkins/jenkins-slave/workspace/ZooKeeper-trunk/build.xml:1452: The following error
occurred while executing this line:
/home/jenkins/jenkins-slave/workspace/ZooKeeper-trunk/build.xml:1462: exec returned: 2

Total time: 18 minutes 18 seconds
Build step 'Execute shell' marked build as failure
[FINDBUGS] Skipping publisher since build result is FAILURE
[WARNINGS] Skipping publisher since build result is FAILURE
Archiving artifacts
[JIRA] Updating issue ZOOKEEPER-3441
Recording test results
Email was triggered for: Failure - Any
Sending email for trigger: Failure - Any



###################################################################################
############################## FAILED TESTS (if any) ##############################
All tests passed
Mime
  • Unnamed multipart/mixed (inline, None, 0 bytes)
View raw message