zookeeper-dev mailing list archives

Site index · List index
Message view « Date » · « Thread »
Top « Date » · « Thread »
From Apache Jenkins Server <jenk...@builds.apache.org>
Subject Build failed in Jenkins: zookeeper-master-maven-jdk12 #45
Date Wed, 17 Jul 2019 12:41:52 GMT
See <https://builds.apache.org/job/zookeeper-master-maven-jdk12/45/display/redirect?page=changes>

Changes:

[andor] ZOOKEEPER-2563: A revisit to setquota

------------------------------------------
[...truncated 925.42 KB...]
[INFO] zookeeper-recipes-lock-3.6.0-SNAPSHOT.jar - SHA-512 : 8fb650566ef12ca97cf6fb5ff59b07aa09836f8e36e77df3a3f544776694341327288cf54515d55b43f86b5cfb60e5310cf8d0625cf42473090500ac8e5700ce
[INFO] zookeeper-recipes-lock-3.6.0-SNAPSHOT-tests.jar - SHA-512 : 7bf9cdffaed0f021321c186510a187884d7b998c0a129a8fab2bdfca0dc2c9600d16cfa1240f5273176e9ec0900b42fa26aa9c4d40e2dc23c2560cddd44ca165
[INFO] zookeeper-recipes-lock-3.6.0-SNAPSHOT-sources.jar - SHA-512 : 0eb32b1a8110157ffd72b29285b85bb970ce3157cb81c66da36c089d2467391359ef1afcb113c891bd1d74a13521ca618f7733ed3a4b36b68bee3c985356265b
[INFO] 
[INFO] >>> spotbugs-maven-plugin:3.1.9:check (default-cli) > :spotbugs @ zookeeper-recipes-lock
>>>
[INFO] 
[INFO] --- spotbugs-maven-plugin:3.1.9:spotbugs (spotbugs) @ zookeeper-recipes-lock ---
[INFO] Fork Value is true
     [java] SLF4J: No SLF4J providers were found.
     [java] SLF4J: Defaulting to no-operation (NOP) logger implementation
     [java] SLF4J: See http://www.slf4j.org/codes.html#noProviders for further details.
[INFO] Done SpotBugs Analysis....
[INFO] 
[INFO] <<< spotbugs-maven-plugin:3.1.9:check (default-cli) < :spotbugs @ zookeeper-recipes-lock
<<<
[INFO] 
[INFO] 
[INFO] --- spotbugs-maven-plugin:3.1.9:check (default-cli) @ zookeeper-recipes-lock ---
[INFO] BugInstance size is 0
[INFO] Error size is 0
[INFO] No errors/warnings found
[INFO] 
[INFO] --- maven-checkstyle-plugin:3.0.0:check (default-cli) @ zookeeper-recipes-lock ---
[INFO] Starting audit...
Audit done.
[INFO] 
[INFO] ------------< org.apache.zookeeper:zookeeper-recipes-queue >------------
[INFO] Building Apache ZooKeeper - Recipes - Queue 3.6.0-SNAPSHOT       [12/17]
[INFO] --------------------------------[ jar ]---------------------------------
[INFO] 
[INFO] --- git-commit-id-plugin:3.0.0:revision (find-current-git-revision) @ zookeeper-recipes-queue
---
[INFO] 
[INFO] --- maven-antrun-plugin:1.8:run (default) @ zookeeper-recipes-queue ---
[INFO] Executing tasks

main:
[INFO] Executed tasks
[INFO] 
[INFO] --- maven-remote-resources-plugin:1.5:process (process-resource-bundles) @ zookeeper-recipes-queue
---
[INFO] 
[INFO] --- maven-resources-plugin:2.7:resources (default-resources) @ zookeeper-recipes-queue
---
[INFO] Using 'UTF-8' encoding to copy filtered resources.
[INFO] skip non existing resourceDirectory <https://builds.apache.org/job/zookeeper-master-maven-jdk12/ws/zookeeper-recipes/zookeeper-recipes-queuesrc/main/java/resources>
[INFO] Copying 3 resources
[INFO] 
[INFO] --- maven-compiler-plugin:3.8.0:compile (default-compile) @ zookeeper-recipes-queue
---
[INFO] Changes detected - recompiling the module!
[INFO] Compiling 1 source file to <https://builds.apache.org/job/zookeeper-master-maven-jdk12/ws/zookeeper-recipes/zookeeper-recipes-queue/target/classes>
[INFO] 
[INFO] --- maven-resources-plugin:2.7:testResources (default-testResources) @ zookeeper-recipes-queue
---
[INFO] Using 'UTF-8' encoding to copy filtered resources.
[INFO] skip non existing resourceDirectory <https://builds.apache.org/job/zookeeper-master-maven-jdk12/ws/zookeeper-recipes/zookeeper-recipes-queue/src/test/resources>
[INFO] Copying 3 resources
[INFO] 
[INFO] --- maven-compiler-plugin:3.8.0:testCompile (default-testCompile) @ zookeeper-recipes-queue
---
[INFO] Changes detected - recompiling the module!
[INFO] Compiling 1 source file to <https://builds.apache.org/job/zookeeper-master-maven-jdk12/ws/zookeeper-recipes/zookeeper-recipes-queue/target/test-classes>
[INFO] 
[INFO] --- maven-surefire-plugin:2.22.1:test (default-test) @ zookeeper-recipes-queue ---
[INFO] 
[INFO] -------------------------------------------------------
[INFO]  T E S T S
[INFO] -------------------------------------------------------
[INFO] Running org.apache.zookeeper.recipes.queue.DistributedQueueTest
[INFO] Tests run: 12, Failures: 0, Errors: 0, Skipped: 0, Time elapsed: 91.838 s - in org.apache.zookeeper.recipes.queue.DistributedQueueTest
[INFO] 
[INFO] Results:
[INFO] 
[INFO] Tests run: 12, Failures: 0, Errors: 0, Skipped: 0
[INFO] 
[JENKINS] Recording test results
[INFO] 
[INFO] --- maven-jar-plugin:3.1.0:jar (default-jar) @ zookeeper-recipes-queue ---
[INFO] Building jar: <https://builds.apache.org/job/zookeeper-master-maven-jdk12/ws/zookeeper-recipes/zookeeper-recipes-queue/target/zookeeper-recipes-queue-3.6.0-SNAPSHOT.jar>
[INFO] 
[INFO] --- maven-site-plugin:3.5.1:attach-descriptor (attach-descriptor) @ zookeeper-recipes-queue
---
[INFO] 
[INFO] --- maven-jar-plugin:3.1.0:test-jar (Jar Tests Package) @ zookeeper-recipes-queue ---
[INFO] Building jar: <https://builds.apache.org/job/zookeeper-master-maven-jdk12/ws/zookeeper-recipes/zookeeper-recipes-queue/target/zookeeper-recipes-queue-3.6.0-SNAPSHOT-tests.jar>
[INFO] 
[INFO] >>> maven-source-plugin:3.0.1:jar (attach-sources) > generate-sources @
zookeeper-recipes-queue >>>
[INFO] 
[INFO] --- git-commit-id-plugin:3.0.0:revision (find-current-git-revision) @ zookeeper-recipes-queue
---
[INFO] 
[INFO] --- maven-antrun-plugin:1.8:run (default) @ zookeeper-recipes-queue ---
[INFO] Executing tasks

main:
[INFO] Executed tasks
[WARNING] Failed to getClass for org.apache.maven.plugins.source.SourceJarMojo
[INFO] 
[INFO] <<< maven-source-plugin:3.0.1:jar (attach-sources) < generate-sources @
zookeeper-recipes-queue <<<
[INFO] 
[INFO] 
[INFO] --- maven-source-plugin:3.0.1:jar (attach-sources) @ zookeeper-recipes-queue ---
[INFO] Building jar: <https://builds.apache.org/job/zookeeper-master-maven-jdk12/ws/zookeeper-recipes/zookeeper-recipes-queue/target/zookeeper-recipes-queue-3.6.0-SNAPSHOT-sources.jar>
[INFO] 
[INFO] --- maven-javadoc-plugin:3.0.1:jar (attach-javadocs) @ zookeeper-recipes-queue ---
[INFO] 
[INFO] --- checksum-maven-plugin:1.8:artifacts (default) @ zookeeper-recipes-queue ---
[INFO] zookeeper-recipes-queue-3.6.0-SNAPSHOT.jar - SHA-512 : 2e7578e1413f907baf33650e9799848b1b7e1adae36771b4cd577117560155e269c4d9be84f625182b7011b9724e006f83e17315cf88c0c85b705f838d8fd723
[INFO] zookeeper-recipes-queue-3.6.0-SNAPSHOT-tests.jar - SHA-512 : 5d49c8d824beb847d8a801f9832bf63951d1d673451b4222dacdd4ae3584ad413a068f3aa2b23baf0fb48b0f28ff154ab386f2522167e94526c32100abf1e4fb
[INFO] zookeeper-recipes-queue-3.6.0-SNAPSHOT-sources.jar - SHA-512 : 95b788fbb7069c8ccdc7aef8c837f3aa945bb201e7b1bd4d613f5e0f5e67232d5f77fdee6c3c9ec81c525b9cd231d534eebd8cd622d7e6b3e76d23b8bbf7d453
[INFO] 
[INFO] >>> spotbugs-maven-plugin:3.1.9:check (default-cli) > :spotbugs @ zookeeper-recipes-queue
>>>
[INFO] 
[INFO] --- spotbugs-maven-plugin:3.1.9:spotbugs (spotbugs) @ zookeeper-recipes-queue ---
[INFO] Fork Value is true
     [java] SLF4J: No SLF4J providers were found.
     [java] SLF4J: Defaulting to no-operation (NOP) logger implementation
     [java] SLF4J: See http://www.slf4j.org/codes.html#noProviders for further details.
[INFO] Done SpotBugs Analysis....
[INFO] 
[INFO] <<< spotbugs-maven-plugin:3.1.9:check (default-cli) < :spotbugs @ zookeeper-recipes-queue
<<<
[INFO] 
[INFO] 
[INFO] --- spotbugs-maven-plugin:3.1.9:check (default-cli) @ zookeeper-recipes-queue ---
[INFO] BugInstance size is 0
[INFO] Error size is 0
[INFO] No errors/warnings found
[INFO] 
[INFO] --- maven-checkstyle-plugin:3.0.0:check (default-cli) @ zookeeper-recipes-queue ---
[INFO] Starting audit...
Audit done.
[INFO] 
[INFO] --------------< org.apache.zookeeper:zookeeper-assembly >---------------
[INFO] Building Apache ZooKeeper - Assembly 3.6.0-SNAPSHOT              [13/17]
[INFO] --------------------------------[ pom ]---------------------------------
[INFO] 
[INFO] --- git-commit-id-plugin:3.0.0:revision (find-current-git-revision) @ zookeeper-assembly
---
[INFO] 
[INFO] --- maven-antrun-plugin:1.8:run (default) @ zookeeper-assembly ---
[INFO] Executing tasks

main:
[INFO] Executed tasks
[INFO] 
[INFO] --- maven-remote-resources-plugin:1.5:process (process-resource-bundles) @ zookeeper-assembly
---
[INFO] 
[INFO] --- maven-site-plugin:3.5.1:attach-descriptor (attach-descriptor) @ zookeeper-assembly
---
[INFO] 
[INFO] --- maven-jar-plugin:3.1.0:test-jar (Jar Tests Package) @ zookeeper-assembly ---
[INFO] Skipping packaging of the test-jar
[INFO] 
[INFO] >>> maven-source-plugin:3.0.1:jar (attach-sources) > generate-sources @
zookeeper-assembly >>>
[INFO] 
[INFO] --- git-commit-id-plugin:3.0.0:revision (find-current-git-revision) @ zookeeper-assembly
---
[INFO] 
[INFO] --- maven-antrun-plugin:1.8:run (default) @ zookeeper-assembly ---
[INFO] Executing tasks

main:
[INFO] Executed tasks
[WARNING] Failed to getClass for org.apache.maven.plugins.source.SourceJarMojo
[INFO] 
[INFO] <<< maven-source-plugin:3.0.1:jar (attach-sources) < generate-sources @
zookeeper-assembly <<<
[INFO] 
[INFO] 
[INFO] --- maven-source-plugin:3.0.1:jar (attach-sources) @ zookeeper-assembly ---
[INFO] 
[INFO] --- maven-javadoc-plugin:3.0.1:jar (attach-javadocs) @ zookeeper-assembly ---
[INFO] Not executing Javadoc as the project is not a Java classpath-capable package
[INFO] 
[INFO] --- maven-assembly-plugin:3.1.0:single (source-assembly) @ zookeeper-assembly ---
[INFO] Downloading from central: https://repo.maven.apache.org/maven2/org/apache/maven/shared/maven-artifact-transfer/0.9.0/maven-artifact-transfer-0.9.0.pom
[WARNING] Failed to getClass for org.apache.maven.plugins.assembly.mojos.SingleAssemblyMojo
[INFO] ------------------------------------------------------------------------
[INFO] Reactor Summary for Apache ZooKeeper 3.6.0-SNAPSHOT:
[INFO] 
[INFO] Apache ZooKeeper ................................... SUCCESS [ 20.563 s]
[INFO] Apache ZooKeeper - Documentation ................... SUCCESS [  9.527 s]
[INFO] Apache ZooKeeper - Jute ............................ SUCCESS [01:15 min]
[INFO] Apache ZooKeeper - Server .......................... SUCCESS [16:24 min]
[INFO] Apache ZooKeeper - Metrics Providers ............... SUCCESS [  3.134 s]
[INFO] Apache ZooKeeper - Prometheus.io Metrics Provider .. SUCCESS [ 15.359 s]
[INFO] Apache ZooKeeper - Client .......................... SUCCESS [  3.152 s]
[INFO] Apache ZooKeeper - Client - C ...................... SUCCESS [06:10 min]
[INFO] Apache ZooKeeper - Recipes ......................... SUCCESS [  3.299 s]
[INFO] Apache ZooKeeper - Recipes - Election .............. SUCCESS [ 44.214 s]
[INFO] Apache ZooKeeper - Recipes - Lock .................. SUCCESS [ 32.835 s]
[INFO] Apache ZooKeeper - Recipes - Queue ................. SUCCESS [01:43 min]
[INFO] Apache ZooKeeper - Assembly ........................ FAILURE [  3.265 s]
[INFO] Apache ZooKeeper - Contrib ......................... SKIPPED
[INFO] Apache ZooKeeper - Contrib - Loggraph .............. SKIPPED
[INFO] Apache ZooKeeper - Contrib - Rest .................. SKIPPED
[INFO] Apache ZooKeeper - Contrib - ZooInspector .......... SKIPPED
[INFO] ------------------------------------------------------------------------
[INFO] BUILD FAILURE
[INFO] ------------------------------------------------------------------------
[INFO] Total time:  29:00 min
[INFO] Finished at: 2019-07-17T12:41:41Z
[INFO] ------------------------------------------------------------------------
Waiting for Jenkins to finish collecting data
[ERROR] Failed to execute goal org.apache.maven.plugins:maven-assembly-plugin:3.1.0:single
(source-assembly) on project zookeeper-assembly: Execution source-assembly of goal org.apache.maven.plugins:maven-assembly-plugin:3.1.0:single
failed: Plugin org.apache.maven.plugins:maven-assembly-plugin:3.1.0 or one of its dependencies
could not be resolved: Failed to collect dependencies at org.apache.maven.plugins:maven-assembly-plugin:jar:3.1.0
-> org.apache.maven.shared:maven-artifact-transfer:jar:0.9.0: Failed to read artifact descriptor
for org.apache.maven.shared:maven-artifact-transfer:jar:0.9.0: Could not transfer artifact
org.apache.maven.shared:maven-artifact-transfer:pom:0.9.0 from/to central (https://repo.maven.apache.org/maven2):
Connection reset -> [Help 1]
[ERROR] 
[ERROR] To see the full stack trace of the errors, re-run Maven with the -e switch.
[ERROR] Re-run Maven using the -X switch to enable full debug logging.
[ERROR] 
[ERROR] For more information about the errors and possible solutions, please read the following
articles:
[ERROR] [Help 1] http://cwiki.apache.org/confluence/display/MAVEN/PluginResolutionException
[ERROR] 
[ERROR] After correcting the problems, you can resume the build with the command
[ERROR]   mvn <goals> -rf :zookeeper-assembly
[JENKINS] Archiving <https://builds.apache.org/job/zookeeper-master-maven-jdk12/ws/zookeeper-server/pom.xml>
to org.apache.zookeeper/zookeeper/3.6.0-SNAPSHOT/zookeeper-3.6.0-SNAPSHOT.pom
[JENKINS] Archiving <https://builds.apache.org/job/zookeeper-master-maven-jdk12/ws/zookeeper-server/target/zookeeper-3.6.0-SNAPSHOT.jar>
to org.apache.zookeeper/zookeeper/3.6.0-SNAPSHOT/zookeeper-3.6.0-SNAPSHOT.jar
[JENKINS] Archiving <https://builds.apache.org/job/zookeeper-master-maven-jdk12/ws/zookeeper-server/target/zookeeper-3.6.0-SNAPSHOT-tests.jar>
to org.apache.zookeeper/zookeeper/3.6.0-SNAPSHOT/zookeeper-3.6.0-SNAPSHOT-tests.jar
[JENKINS] Archiving <https://builds.apache.org/job/zookeeper-master-maven-jdk12/ws/zookeeper-server/target/zookeeper-3.6.0-SNAPSHOT-sources.jar>
to org.apache.zookeeper/zookeeper/3.6.0-SNAPSHOT/zookeeper-3.6.0-SNAPSHOT-sources.jar
[JENKINS] Archiving <https://builds.apache.org/job/zookeeper-master-maven-jdk12/ws/zookeeper-server/target/zookeeper-3.6.0-SNAPSHOT-javadoc.jar>
to org.apache.zookeeper/zookeeper/3.6.0-SNAPSHOT/zookeeper-3.6.0-SNAPSHOT-javadoc.jar
[JENKINS] Archiving <https://builds.apache.org/job/zookeeper-master-maven-jdk12/ws/zookeeper-contrib/zookeeper-contrib-loggraph/pom.xml>
to org.apache.zookeeper/zookeeper-contrib-loggraph/3.6.0-SNAPSHOT/zookeeper-contrib-loggraph-3.6.0-SNAPSHOT.pom
[JENKINS] Archiving <https://builds.apache.org/job/zookeeper-master-maven-jdk12/ws/zookeeper-metrics-providers/pom.xml>
to org.apache.zookeeper/zookeeper-metrics-providers/3.6.0-SNAPSHOT/zookeeper-metrics-providers-3.6.0-SNAPSHOT.pom
[JENKINS] Archiving <https://builds.apache.org/job/zookeeper-master-maven-jdk12/ws/zookeeper-metrics-providers/zookeeper-prometheus-metrics/pom.xml>
to org.apache.zookeeper/zookeeper-prometheus-metrics/3.6.0-SNAPSHOT/zookeeper-prometheus-metrics-3.6.0-SNAPSHOT.pom
[JENKINS] Archiving <https://builds.apache.org/job/zookeeper-master-maven-jdk12/ws/zookeeper-metrics-providers/zookeeper-prometheus-metrics/target/zookeeper-prometheus-metrics-3.6.0-SNAPSHOT.jar>
to org.apache.zookeeper/zookeeper-prometheus-metrics/3.6.0-SNAPSHOT/zookeeper-prometheus-metrics-3.6.0-SNAPSHOT.jar
[JENKINS] Archiving <https://builds.apache.org/job/zookeeper-master-maven-jdk12/ws/zookeeper-metrics-providers/zookeeper-prometheus-metrics/target/zookeeper-prometheus-metrics-3.6.0-SNAPSHOT-tests.jar>
to org.apache.zookeeper/zookeeper-prometheus-metrics/3.6.0-SNAPSHOT/zookeeper-prometheus-metrics-3.6.0-SNAPSHOT-tests.jar
[JENKINS] Archiving <https://builds.apache.org/job/zookeeper-master-maven-jdk12/ws/zookeeper-metrics-providers/zookeeper-prometheus-metrics/target/zookeeper-prometheus-metrics-3.6.0-SNAPSHOT-sources.jar>
to org.apache.zookeeper/zookeeper-prometheus-metrics/3.6.0-SNAPSHOT/zookeeper-prometheus-metrics-3.6.0-SNAPSHOT-sources.jar
[JENKINS] Archiving <https://builds.apache.org/job/zookeeper-master-maven-jdk12/ws/zookeeper-metrics-providers/zookeeper-prometheus-metrics/target/zookeeper-prometheus-metrics-3.6.0-SNAPSHOT-javadoc.jar>
to org.apache.zookeeper/zookeeper-prometheus-metrics/3.6.0-SNAPSHOT/zookeeper-prometheus-metrics-3.6.0-SNAPSHOT-javadoc.jar
[Fast Archiver] Compressed 444.00 KB of artifacts by 28.8% relative to #44
[JENKINS] Archiving <https://builds.apache.org/job/zookeeper-master-maven-jdk12/ws/zookeeper-recipes/zookeeper-recipes-election/pom.xml>
to org.apache.zookeeper/zookeeper-recipes-election/3.6.0-SNAPSHOT/zookeeper-recipes-election-3.6.0-SNAPSHOT.pom
[JENKINS] Archiving <https://builds.apache.org/job/zookeeper-master-maven-jdk12/ws/zookeeper-recipes/zookeeper-recipes-election/target/zookeeper-recipes-election-3.6.0-SNAPSHOT.jar>
to org.apache.zookeeper/zookeeper-recipes-election/3.6.0-SNAPSHOT/zookeeper-recipes-election-3.6.0-SNAPSHOT.jar
[JENKINS] Archiving <https://builds.apache.org/job/zookeeper-master-maven-jdk12/ws/zookeeper-recipes/zookeeper-recipes-election/target/zookeeper-recipes-election-3.6.0-SNAPSHOT-tests.jar>
to org.apache.zookeeper/zookeeper-recipes-election/3.6.0-SNAPSHOT/zookeeper-recipes-election-3.6.0-SNAPSHOT-tests.jar
[JENKINS] Archiving <https://builds.apache.org/job/zookeeper-master-maven-jdk12/ws/zookeeper-recipes/zookeeper-recipes-election/target/zookeeper-recipes-election-3.6.0-SNAPSHOT-sources.jar>
to org.apache.zookeeper/zookeeper-recipes-election/3.6.0-SNAPSHOT/zookeeper-recipes-election-3.6.0-SNAPSHOT-sources.jar
[JENKINS] Archiving <https://builds.apache.org/job/zookeeper-master-maven-jdk12/ws/pom.xml>
to org.apache.zookeeper/parent/3.6.0-SNAPSHOT/parent-3.6.0-SNAPSHOT.pom
[JENKINS] Archiving <https://builds.apache.org/job/zookeeper-master-maven-jdk12/ws/zookeeper-recipes/zookeeper-recipes-lock/pom.xml>
to org.apache.zookeeper/zookeeper-recipes-lock/3.6.0-SNAPSHOT/zookeeper-recipes-lock-3.6.0-SNAPSHOT.pom
[JENKINS] Archiving <https://builds.apache.org/job/zookeeper-master-maven-jdk12/ws/zookeeper-recipes/zookeeper-recipes-lock/target/zookeeper-recipes-lock-3.6.0-SNAPSHOT.jar>
to org.apache.zookeeper/zookeeper-recipes-lock/3.6.0-SNAPSHOT/zookeeper-recipes-lock-3.6.0-SNAPSHOT.jar
[JENKINS] Archiving <https://builds.apache.org/job/zookeeper-master-maven-jdk12/ws/zookeeper-recipes/zookeeper-recipes-lock/target/zookeeper-recipes-lock-3.6.0-SNAPSHOT-tests.jar>
to org.apache.zookeeper/zookeeper-recipes-lock/3.6.0-SNAPSHOT/zookeeper-recipes-lock-3.6.0-SNAPSHOT-tests.jar
[JENKINS] Archiving <https://builds.apache.org/job/zookeeper-master-maven-jdk12/ws/zookeeper-recipes/zookeeper-recipes-lock/target/zookeeper-recipes-lock-3.6.0-SNAPSHOT-sources.jar>
to org.apache.zookeeper/zookeeper-recipes-lock/3.6.0-SNAPSHOT/zookeeper-recipes-lock-3.6.0-SNAPSHOT-sources.jar
[JENKINS] Archiving <https://builds.apache.org/job/zookeeper-master-maven-jdk12/ws/zookeeper-contrib/pom.xml>
to org.apache.zookeeper/zookeeper-contrib/3.6.0-SNAPSHOT/zookeeper-contrib-3.6.0-SNAPSHOT.pom
[JENKINS] Archiving <https://builds.apache.org/job/zookeeper-master-maven-jdk12/ws/zookeeper-client/pom.xml>
to org.apache.zookeeper/zookeeper-client/3.6.0-SNAPSHOT/zookeeper-client-3.6.0-SNAPSHOT.pom
[JENKINS] Archiving <https://builds.apache.org/job/zookeeper-master-maven-jdk12/ws/zookeeper-jute/pom.xml>
to org.apache.zookeeper/zookeeper-jute/3.6.0-SNAPSHOT/zookeeper-jute-3.6.0-SNAPSHOT.pom
[JENKINS] Archiving <https://builds.apache.org/job/zookeeper-master-maven-jdk12/ws/zookeeper-jute/target/zookeeper-jute-3.6.0-SNAPSHOT.jar>
to org.apache.zookeeper/zookeeper-jute/3.6.0-SNAPSHOT/zookeeper-jute-3.6.0-SNAPSHOT.jar
[JENKINS] Archiving <https://builds.apache.org/job/zookeeper-master-maven-jdk12/ws/zookeeper-jute/target/zookeeper-jute-3.6.0-SNAPSHOT-tests.jar>
to org.apache.zookeeper/zookeeper-jute/3.6.0-SNAPSHOT/zookeeper-jute-3.6.0-SNAPSHOT-tests.jar
[JENKINS] Archiving <https://builds.apache.org/job/zookeeper-master-maven-jdk12/ws/zookeeper-jute/target/zookeeper-jute-3.6.0-SNAPSHOT-sources.jar>
to org.apache.zookeeper/zookeeper-jute/3.6.0-SNAPSHOT/zookeeper-jute-3.6.0-SNAPSHOT-sources.jar
[JENKINS] Archiving <https://builds.apache.org/job/zookeeper-master-maven-jdk12/ws/zookeeper-jute/target/zookeeper-jute-3.6.0-SNAPSHOT-javadoc.jar>
to org.apache.zookeeper/zookeeper-jute/3.6.0-SNAPSHOT/zookeeper-jute-3.6.0-SNAPSHOT-javadoc.jar
[JENKINS] Archiving <https://builds.apache.org/job/zookeeper-master-maven-jdk12/ws/zookeeper-recipes/zookeeper-recipes-queue/pom.xml>
to org.apache.zookeeper/zookeeper-recipes-queue/3.6.0-SNAPSHOT/zookeeper-recipes-queue-3.6.0-SNAPSHOT.pom
[JENKINS] Archiving <https://builds.apache.org/job/zookeeper-master-maven-jdk12/ws/zookeeper-recipes/zookeeper-recipes-queue/target/zookeeper-recipes-queue-3.6.0-SNAPSHOT.jar>
to org.apache.zookeeper/zookeeper-recipes-queue/3.6.0-SNAPSHOT/zookeeper-recipes-queue-3.6.0-SNAPSHOT.jar
[JENKINS] Archiving <https://builds.apache.org/job/zookeeper-master-maven-jdk12/ws/zookeeper-recipes/zookeeper-recipes-queue/target/zookeeper-recipes-queue-3.6.0-SNAPSHOT-tests.jar>
to org.apache.zookeeper/zookeeper-recipes-queue/3.6.0-SNAPSHOT/zookeeper-recipes-queue-3.6.0-SNAPSHOT-tests.jar
[JENKINS] Archiving <https://builds.apache.org/job/zookeeper-master-maven-jdk12/ws/zookeeper-recipes/zookeeper-recipes-queue/target/zookeeper-recipes-queue-3.6.0-SNAPSHOT-sources.jar>
to org.apache.zookeeper/zookeeper-recipes-queue/3.6.0-SNAPSHOT/zookeeper-recipes-queue-3.6.0-SNAPSHOT-sources.jar
[JENKINS] Archiving <https://builds.apache.org/job/zookeeper-master-maven-jdk12/ws/zookeeper-docs/pom.xml>
to org.apache.zookeeper/zookeeper-docs/3.6.0-SNAPSHOT/zookeeper-docs-3.6.0-SNAPSHOT.pom
[JENKINS] Archiving <https://builds.apache.org/job/zookeeper-master-maven-jdk12/ws/zookeeper-docs/target/zookeeper-docs-3.6.0-SNAPSHOT.jar>
to org.apache.zookeeper/zookeeper-docs/3.6.0-SNAPSHOT/zookeeper-docs-3.6.0-SNAPSHOT.jar
[JENKINS] Archiving <https://builds.apache.org/job/zookeeper-master-maven-jdk12/ws/zookeeper-docs/target/zookeeper-docs-3.6.0-SNAPSHOT-tests.jar>
to org.apache.zookeeper/zookeeper-docs/3.6.0-SNAPSHOT/zookeeper-docs-3.6.0-SNAPSHOT-tests.jar
[JENKINS] Archiving <https://builds.apache.org/job/zookeeper-master-maven-jdk12/ws/zookeeper-docs/target/zookeeper-docs-3.6.0-SNAPSHOT-sources.jar>
to org.apache.zookeeper/zookeeper-docs/3.6.0-SNAPSHOT/zookeeper-docs-3.6.0-SNAPSHOT-sources.jar
[JENKINS] Archiving <https://builds.apache.org/job/zookeeper-master-maven-jdk12/ws/zookeeper-recipes/pom.xml>
to org.apache.zookeeper/zookeeper-recipes/3.6.0-SNAPSHOT/zookeeper-recipes-3.6.0-SNAPSHOT.pom
[JENKINS] Archiving <https://builds.apache.org/job/zookeeper-master-maven-jdk12/ws/zookeeper-client/zookeeper-client-c/pom.xml>
to org.apache.zookeeper/zookeeper-client-c/3.6.0-SNAPSHOT/zookeeper-client-c-3.6.0-SNAPSHOT.pom
[JENKINS] Archiving <https://builds.apache.org/job/zookeeper-master-maven-jdk12/ws/zookeeper-client/zookeeper-client-c/target/zookeeper-client-c-3.6.0-SNAPSHOT.jar>
to org.apache.zookeeper/zookeeper-client-c/3.6.0-SNAPSHOT/zookeeper-client-c-3.6.0-SNAPSHOT.jar
[JENKINS] Archiving <https://builds.apache.org/job/zookeeper-master-maven-jdk12/ws/zookeeper-client/zookeeper-client-c/target/zookeeper-client-c-3.6.0-SNAPSHOT-tests.jar>
to org.apache.zookeeper/zookeeper-client-c/3.6.0-SNAPSHOT/zookeeper-client-c-3.6.0-SNAPSHOT-tests.jar
[JENKINS] Archiving <https://builds.apache.org/job/zookeeper-master-maven-jdk12/ws/zookeeper-client/zookeeper-client-c/target/zookeeper-client-c-3.6.0-SNAPSHOT-sources.jar>
to org.apache.zookeeper/zookeeper-client-c/3.6.0-SNAPSHOT/zookeeper-client-c-3.6.0-SNAPSHOT-sources.jar
[JENKINS] Archiving <https://builds.apache.org/job/zookeeper-master-maven-jdk12/ws/zookeeper-contrib/zookeeper-contrib-rest/pom.xml>
to org.apache.zookeeper/zookeeper-contrib-rest/3.6.0-SNAPSHOT/zookeeper-contrib-rest-3.6.0-SNAPSHOT.pom
[JENKINS] Archiving <https://builds.apache.org/job/zookeeper-master-maven-jdk12/ws/zookeeper-assembly/pom.xml>
to org.apache.zookeeper/zookeeper-assembly/3.6.0-SNAPSHOT/zookeeper-assembly-3.6.0-SNAPSHOT.pom
[JENKINS] Archiving <https://builds.apache.org/job/zookeeper-master-maven-jdk12/ws/zookeeper-contrib/zookeeper-contrib-zooinspector/pom.xml>
to org.apache.zookeeper/zookeeper-contrib-zooinspector/3.6.0-SNAPSHOT/zookeeper-contrib-zooinspector-3.6.0-SNAPSHOT.pom
channel stopped
[SpotBugs] Skipping execution of recorder since overall result is 'FAILURE'

Mime
View raw message