zookeeper-dev mailing list archives

Site index · List index
Message view « Date » · « Thread »
Top « Date » · « Thread »
From Apache Jenkins Server <jenk...@builds.apache.org>
Subject Build failed in Jenkins: zookeeper-master-maven-owasp #26
Date Sat, 06 Jul 2019 09:26:47 GMT
See <https://builds.apache.org/job/zookeeper-master-maven-owasp/26/display/redirect>

------------------------------------------
Started by timer
[EnvInject] - Loading node environment variables.
Building remotely on H16 (Hadoop xenial) in workspace <https://builds.apache.org/job/zookeeper-master-maven-owasp/ws/>
[WS-CLEANUP] Deleting project workspace...
[WS-CLEANUP] Deferred wipeout is used...
[WS-CLEANUP] Done
No credentials specified
Cloning the remote Git repository
Using shallow clone
shallow clone depth 10
Avoid fetching tags
Cloning repository https://github.com/apache/zookeeper
 > git init <https://builds.apache.org/job/zookeeper-master-maven-owasp/ws/> # timeout=10
Fetching upstream changes from https://github.com/apache/zookeeper
 > git --version # timeout=10
 > git fetch --no-tags --progress https://github.com/apache/zookeeper +refs/heads/*:refs/remotes/origin/*
--depth=10
 > git config remote.origin.url https://github.com/apache/zookeeper # timeout=10
 > git config --add remote.origin.fetch +refs/heads/*:refs/remotes/origin/* # timeout=10
 > git config remote.origin.url https://github.com/apache/zookeeper # timeout=10
Fetching upstream changes from https://github.com/apache/zookeeper
 > git fetch --no-tags --progress https://github.com/apache/zookeeper +refs/heads/*:refs/remotes/origin/*
--depth=10
 > git rev-parse refs/remotes/origin/master^{commit} # timeout=10
 > git rev-parse refs/remotes/origin/origin/master^{commit} # timeout=10
Checking out Revision 4cadbb1a649b70a2243bc4c1e5f736df4d35c462 (refs/remotes/origin/master)
 > git config core.sparsecheckout # timeout=10
 > git checkout -f 4cadbb1a649b70a2243bc4c1e5f736df4d35c462
Commit message: "ZOOKEEPER-2418: txnlog diff sync can skip sending some transactions t?"
 > git rev-list --no-walk 4cadbb1a649b70a2243bc4c1e5f736df4d35c462 # timeout=10
Parsing POMs
Established TCP socket on 35204
maven35-agent.jar already up to date
maven35-interceptor.jar already up to date
maven3-interceptor-commons.jar already up to date
[zookeeper-master-maven-owasp] $ /home/jenkins/tools/java/latest1.8/bin/java -Xmx4g -Xms4g
-cp /home/jenkins/jenkins-slave/maven35-agent.jar:/home/jenkins/tools/maven/apache-maven-3.6.0/boot/plexus-classworlds-2.5.2.jar:/home/jenkins/tools/maven/apache-maven-3.6.0/conf/logging
jenkins.maven3.agent.Maven35Main /home/jenkins/tools/maven/apache-maven-3.6.0 /home/jenkins/jenkins-slave/remoting.jar
/home/jenkins/jenkins-slave/maven35-interceptor.jar /home/jenkins/jenkins-slave/maven3-interceptor-commons.jar
35204
<===[JENKINS REMOTING CAPACITY]===>   channel started
Executing Maven:  -B -f <https://builds.apache.org/job/zookeeper-master-maven-owasp/ws/pom.xml>
-Dmaven.repo.local=/home/jenkins/jenkins-slave/maven-repositories/0 clean package -DskipTests
dependency-check:check
[INFO] Scanning for projects...
[INFO] ------------------------------------------------------------------------
[INFO] Reactor Build Order:
[INFO] 
[INFO] Apache ZooKeeper                                                   [pom]
[INFO] Apache ZooKeeper - Documentation                                   [jar]
[INFO] Apache ZooKeeper - Jute                                            [jar]
[INFO] Apache ZooKeeper - Server                                          [jar]
[INFO] Apache ZooKeeper - Metrics Providers                               [pom]
[INFO] Apache ZooKeeper - Prometheus.io Metrics Provider                  [jar]
[INFO] Apache ZooKeeper - Client                                          [pom]
[INFO] Apache ZooKeeper - Recipes                                         [pom]
[INFO] Apache ZooKeeper - Recipes - Election                              [jar]
[INFO] Apache ZooKeeper - Recipes - Lock                                  [jar]
[INFO] Apache ZooKeeper - Recipes - Queue                                 [jar]
[INFO] Apache ZooKeeper - Assembly                                        [pom]
[INFO] 
[INFO] --------------------< org.apache.zookeeper:parent >---------------------
[INFO] Building Apache ZooKeeper 3.6.0-SNAPSHOT                          [1/12]
[INFO] --------------------------------[ pom ]---------------------------------
[INFO] 
[INFO] --- maven-clean-plugin:3.0.0:clean (default-clean) @ parent ---
[INFO] 
[INFO] --- git-commit-id-plugin:2.2.5:revision (find-current-git-revision) @ parent ---
[INFO] 
[INFO] --- maven-antrun-plugin:1.8:run (default) @ parent ---
[INFO] Executing tasks

main:
[INFO] Executed tasks
[INFO] 
[INFO] --- maven-remote-resources-plugin:1.5:process (process-resource-bundles) @ parent ---
[INFO] 
[INFO] --- maven-site-plugin:3.5.1:attach-descriptor (attach-descriptor) @ parent ---
[WARNING] Attempt to (de-)serialize anonymous class hudson.maven.reporters.BuildInfoRecorder$1;
see: https://jenkins.io/redirect/serialization-of-anonymous-classes/
[INFO] 
[INFO] --- maven-jar-plugin:3.1.0:test-jar (Jar Tests Package) @ parent ---
[INFO] Skipping packaging of the test-jar
[INFO] 
[INFO] >>> maven-source-plugin:3.0.1:jar (attach-sources) > generate-sources @
parent >>>
[INFO] 
[INFO] --- git-commit-id-plugin:2.2.5:revision (find-current-git-revision) @ parent ---
[INFO] 
[INFO] --- maven-antrun-plugin:1.8:run (default) @ parent ---
[INFO] Executing tasks

main:
[INFO] Executed tasks
[WARNING] Failed to getClass for org.apache.maven.plugins.source.SourceJarMojo
[INFO] 
[INFO] <<< maven-source-plugin:3.0.1:jar (attach-sources) < generate-sources @
parent <<<
[INFO] 
[INFO] 
[INFO] --- maven-source-plugin:3.0.1:jar (attach-sources) @ parent ---
[INFO] 
[INFO] --- maven-javadoc-plugin:3.0.1:jar (attach-javadocs) @ parent ---
[INFO] Not executing Javadoc as the project is not a Java classpath-capable package
[INFO] 
[INFO] --- dependency-check-maven:4.0.2:check (default-cli) @ parent ---
[INFO] Central analyzer disabled
[INFO] Checking for updates
[INFO] starting getUpdatesNeeded() ...
[INFO] NVD CVE requires several updates; this could take a couple of minutes.
[INFO] Download Started for NVD CVE - 2008
[INFO] Download Started for NVD CVE - 2002
[INFO] Download Started for NVD CVE - 2010
[INFO] Download Started for NVD CVE - 2007
[INFO] Download Started for NVD CVE - 2005
[INFO] Download Started for NVD CVE - 2011
[INFO] Download Started for NVD CVE - 2006
[INFO] Download Started for NVD CVE - 2004
[INFO] Download Started for NVD CVE - 2003
[INFO] Download Started for NVD CVE - 2009
[INFO] Download Started for NVD CVE - 2012
[INFO] Download Started for NVD CVE - 2013
[INFO] Download Started for NVD CVE - 2014
[INFO] Download Started for NVD CVE - 2015
[INFO] Download Started for NVD CVE - 2016
[INFO] Download Started for NVD CVE - 2017
[INFO] Download Started for NVD CVE - 2018
[INFO] Download Started for NVD CVE - 2019
[INFO] Download Started for NVD CVE - Modified
[INFO] Download Complete for NVD CVE - 2003  (2117 ms)
[INFO] Processing Started for NVD CVE - 2003
[INFO] Download Complete for NVD CVE - 2004  (2382 ms)
[INFO] Processing Started for NVD CVE - 2004
[INFO] Download Complete for NVD CVE - 2002  (2797 ms)
[INFO] Processing Started for NVD CVE - 2002
[INFO] Download Complete for NVD CVE - 2005  (2835 ms)
[INFO] Processing Started for NVD CVE - 2005
[INFO] Download Complete for NVD CVE - 2012  (3463 ms)
[INFO] Processing Started for NVD CVE - 2012
[INFO] Download Complete for NVD CVE - 2010  (3636 ms)
[INFO] Processing Started for NVD CVE - 2010
[INFO] Download Complete for NVD CVE - 2006  (3728 ms)
[INFO] Processing Started for NVD CVE - 2006
[INFO] Download Complete for NVD CVE - 2014  (3876 ms)
[INFO] Processing Started for NVD CVE - 2014
[INFO] Download Complete for NVD CVE - Modified  (4276 ms)
[INFO] Processing Started for NVD CVE - Modified
[INFO] Download Complete for NVD CVE - 2009  (4322 ms)
[INFO] Download Complete for NVD CVE - 2007  (4325 ms)
[INFO] Processing Started for NVD CVE - 2009
[INFO] Processing Started for NVD CVE - 2007
[INFO] Download Complete for NVD CVE - 2013  (4472 ms)
[INFO] Processing Started for NVD CVE - 2013
[INFO] Download Complete for NVD CVE - 2008  (4589 ms)
[INFO] Processing Started for NVD CVE - 2008
[INFO] Download Complete for NVD CVE - 2016  (4904 ms)
[INFO] Download Complete for NVD CVE - 2015  (4921 ms)
[INFO] Processing Started for NVD CVE - 2016
[INFO] Processing Started for NVD CVE - 2015
[INFO] Download Complete for NVD CVE - 2019  (5009 ms)
[INFO] Processing Started for NVD CVE - 2019
[WARNING] Download Failed for NVD CVE - 2017
Some CVEs may not be reported.
[INFO] If you are behind a proxy you may need to configure dependency-check to use the proxy.
[WARNING] Unable to update Cached Web DataSource, using local data instead. Results may not
include recent vulnerabilities.
[INFO] Download Complete for NVD CVE - 2011  (5936 ms)
[WARNING] An exception occurred downloading NVD CVE - 2011
Some CVEs may not be reported.
[INFO] Analysis Started
[INFO] Finished File Name Analyzer (0 seconds)
[INFO] Finished Dependency Merging Analyzer (0 seconds)
[INFO] Finished Version Filter Analyzer (0 seconds)
[INFO] Finished Hint Analyzer (0 seconds)
[INFO] Created CPE Index (0 seconds)
[INFO] Skipping CPE Analysis for npm
[INFO] Finished CPE Analyzer (0 seconds)
[INFO] Finished False Positive Analyzer (0 seconds)
[INFO] Finished NVD CVE Analyzer (0 seconds)
[INFO] Finished Vulnerability Suppression Analyzer (0 seconds)
[INFO] Finished Dependency Bundling Analyzer (0 seconds)
[INFO] Analysis Complete (1 seconds)
[WARNING] Download Failed for NVD CVE - 2018
Some CVEs may not be reported.
[INFO] If you are behind a proxy you may need to configure dependency-check to use the proxy.
[INFO] ------------------------------------------------------------------------
[INFO] Reactor Summary for Apache ZooKeeper 3.6.0-SNAPSHOT:
[INFO] 
[INFO] Apache ZooKeeper ................................... FAILURE [ 24.022 s]
[INFO] Apache ZooKeeper - Documentation ................... SKIPPED
[INFO] Apache ZooKeeper - Jute ............................ SKIPPED
[INFO] Apache ZooKeeper - Server .......................... SKIPPED
[INFO] Apache ZooKeeper - Metrics Providers ............... SKIPPED
[INFO] Apache ZooKeeper - Prometheus.io Metrics Provider .. SKIPPED
[INFO] Apache ZooKeeper - Client .......................... SKIPPED
[INFO] Apache ZooKeeper - Recipes ......................... SKIPPED
[INFO] Apache ZooKeeper - Recipes - Election .............. SKIPPED
[INFO] Apache ZooKeeper - Recipes - Lock .................. SKIPPED
[INFO] Apache ZooKeeper - Recipes - Queue ................. SKIPPED
[INFO] Apache ZooKeeper - Assembly ........................ SKIPPED
[INFO] ------------------------------------------------------------------------
[INFO] BUILD FAILURE
[INFO] ------------------------------------------------------------------------
[INFO] Total time:  39.559 s
[INFO] Finished at: 2019-07-06T09:26:21Z
[INFO] ------------------------------------------------------------------------
Waiting for Jenkins to finish collecting data
[ERROR] Failed to execute goal org.owasp:dependency-check-maven:4.0.2:check (default-cli)
on project parent: One or more exceptions occurred during dependency-check analysis: One or
more exceptions occurred during dependency-check analysis
[ERROR] The download was interrupted; unable to complete the update
[ERROR] -> [Help 1]
[ERROR] 
[ERROR] To see the full stack trace of the errors, re-run Maven with the -e switch.
[ERROR] Re-run Maven using the -X switch to enable full debug logging.
[ERROR] 
[ERROR] For more information about the errors and possible solutions, please read the following
articles:
[ERROR] [Help 1] http://cwiki.apache.org/confluence/display/MAVEN/MojoExecutionException
[JENKINS] Archiving <https://builds.apache.org/job/zookeeper-master-maven-owasp/ws/zookeeper-server/pom.xml>
to org.apache.zookeeper/zookeeper/3.6.0-SNAPSHOT/zookeeper-3.6.0-SNAPSHOT.pom
[Fast Archiver] No prior successful build to compare, so performing full copy of artifacts
[JENKINS] Archiving <https://builds.apache.org/job/zookeeper-master-maven-owasp/ws/zookeeper-client/pom.xml>
to org.apache.zookeeper/zookeeper-client/3.6.0-SNAPSHOT/zookeeper-client-3.6.0-SNAPSHOT.pom
[Fast Archiver] No prior successful build to compare, so performing full copy of artifacts
[JENKINS] Archiving <https://builds.apache.org/job/zookeeper-master-maven-owasp/ws/zookeeper-jute/pom.xml>
to org.apache.zookeeper/zookeeper-jute/3.6.0-SNAPSHOT/zookeeper-jute-3.6.0-SNAPSHOT.pom
[JENKINS] Archiving <https://builds.apache.org/job/zookeeper-master-maven-owasp/ws/zookeeper-metrics-providers/pom.xml>
to org.apache.zookeeper/zookeeper-metrics-providers/3.6.0-SNAPSHOT/zookeeper-metrics-providers-3.6.0-SNAPSHOT.pom
[Fast Archiver] No prior successful build to compare, so performing full copy of artifacts
[JENKINS] Archiving <https://builds.apache.org/job/zookeeper-master-maven-owasp/ws/zookeeper-metrics-providers/zookeeper-prometheus-metrics/pom.xml>
to org.apache.zookeeper/zookeeper-prometheus-metrics/3.6.0-SNAPSHOT/zookeeper-prometheus-metrics-3.6.0-SNAPSHOT.pom
[Fast Archiver] No prior successful build to compare, so performing full copy of artifacts
[JENKINS] Archiving <https://builds.apache.org/job/zookeeper-master-maven-owasp/ws/zookeeper-recipes/zookeeper-recipes-election/pom.xml>
to org.apache.zookeeper/zookeeper-recipes-election/3.6.0-SNAPSHOT/zookeeper-recipes-election-3.6.0-SNAPSHOT.pom
[Fast Archiver] No prior successful build to compare, so performing full copy of artifacts
[JENKINS] Archiving <https://builds.apache.org/job/zookeeper-master-maven-owasp/ws/zookeeper-recipes/zookeeper-recipes-queue/pom.xml>
to org.apache.zookeeper/zookeeper-recipes-queue/3.6.0-SNAPSHOT/zookeeper-recipes-queue-3.6.0-SNAPSHOT.pom
[Fast Archiver] No prior successful build to compare, so performing full copy of artifacts
[JENKINS] Archiving <https://builds.apache.org/job/zookeeper-master-maven-owasp/ws/zookeeper-docs/pom.xml>
to org.apache.zookeeper/zookeeper-docs/3.6.0-SNAPSHOT/zookeeper-docs-3.6.0-SNAPSHOT.pom
[JENKINS] Archiving <https://builds.apache.org/job/zookeeper-master-maven-owasp/ws/zookeeper-recipes/pom.xml>
to org.apache.zookeeper/zookeeper-recipes/3.6.0-SNAPSHOT/zookeeper-recipes-3.6.0-SNAPSHOT.pom
[Fast Archiver] No prior successful build to compare, so performing full copy of artifacts
[JENKINS] Archiving <https://builds.apache.org/job/zookeeper-master-maven-owasp/ws/pom.xml>
to org.apache.zookeeper/parent/3.6.0-SNAPSHOT/parent-3.6.0-SNAPSHOT.pom
[JENKINS] Archiving <https://builds.apache.org/job/zookeeper-master-maven-owasp/ws/zookeeper-recipes/zookeeper-recipes-lock/pom.xml>
to org.apache.zookeeper/zookeeper-recipes-lock/3.6.0-SNAPSHOT/zookeeper-recipes-lock-3.6.0-SNAPSHOT.pom
[Fast Archiver] No prior successful build to compare, so performing full copy of artifacts
[JENKINS] Archiving <https://builds.apache.org/job/zookeeper-master-maven-owasp/ws/zookeeper-assembly/pom.xml>
to org.apache.zookeeper/zookeeper-assembly/3.6.0-SNAPSHOT/zookeeper-assembly-3.6.0-SNAPSHOT.pom
[Fast Archiver] No prior successful build to compare, so performing full copy of artifacts
channel stopped
[SpotBugs] Skipping execution of recorder since overall result is 'FAILURE'

Mime
View raw message