zookeeper-dev mailing list archives

Site index · List index
Message view « Date » · « Thread »
Top « Date » · « Thread »
From Apache Jenkins Server <jenk...@builds.apache.org>
Subject Build failed in Jenkins: PreCommit-ZOOKEEPER-github-pr-build-maven #1003
Date Mon, 29 Jul 2019 17:24:21 GMT
See <https://builds.apache.org/job/PreCommit-ZOOKEEPER-github-pr-build-maven/1003/display/redirect>

------------------------------------------
[...truncated 742.23 KB...]
[INFO]  T E S T S
[INFO] -------------------------------------------------------
[INFO] Running org.apache.zookeeper.metrics.prometheus.PrometheusMetricsProviderTest
2019-07-29 17:23:14,220 [myid:] - INFO  [main:PrometheusMetricsProvider@74] - Initializing
metrics, configuration: {exportJvmInfo=false, httpPort=0}
2019-07-29 17:23:14,225 [myid:] - INFO  [main:PrometheusMetricsProvider@82] - Starting /metrics
HTTP endpoint at port 0 exportJvmInfo: false
2019-07-29 17:23:14,242 [myid:] - INFO  [main:Log@193] - Logging initialized @544ms to org.eclipse.jetty.util.log.Slf4jLog
2019-07-29 17:23:14,344 [myid:] - INFO  [main:Server@370] - jetty-9.4.18.v20190429; built:
2019-04-29T20:42:08.989Z; git: e1bc35120a6617ee3df052294e433f3a25ce7097; jvm 1.8.0_191-b12
2019-07-29 17:23:14,417 [myid:] - INFO  [main:ContextHandler@855] - Started o.e.j.s.ServletContextHandler@4e7dc304{/,null,AVAILABLE}
2019-07-29 17:23:14,462 [myid:] - INFO  [main:AbstractConnector@292] - Started ServerConnector@3532ec19{HTTP/1.1,[http/1.1]}{0.0.0.0:33321}
2019-07-29 17:23:14,463 [myid:] - INFO  [main:Server@410] - Started @766ms
2019-07-29 17:23:15,256 [myid:] - INFO  [main:AbstractConnector@341] - Stopped ServerConnector@3532ec19{HTTP/1.1,[http/1.1]}{0.0.0.0:0}
2019-07-29 17:23:15,258 [myid:] - INFO  [main:ContextHandler@1045] - Stopped o.e.j.s.ServletContextHandler@4e7dc304{/,null,UNAVAILABLE}
2019-07-29 17:23:15,264 [myid:] - INFO  [main:PrometheusMetricsProvider@74] - Initializing
metrics, configuration: {exportJvmInfo=false, httpPort=0}
2019-07-29 17:23:15,264 [myid:] - INFO  [main:PrometheusMetricsProvider@82] - Starting /metrics
HTTP endpoint at port 0 exportJvmInfo: false
2019-07-29 17:23:15,265 [myid:] - INFO  [main:Server@370] - jetty-9.4.18.v20190429; built:
2019-04-29T20:42:08.989Z; git: e1bc35120a6617ee3df052294e433f3a25ce7097; jvm 1.8.0_191-b12
2019-07-29 17:23:15,269 [myid:] - INFO  [main:ContextHandler@855] - Started o.e.j.s.ServletContextHandler@d62fe5b{/,null,AVAILABLE}
2019-07-29 17:23:15,276 [myid:] - INFO  [main:AbstractConnector@292] - Started ServerConnector@45312be2{HTTP/1.1,[http/1.1]}{0.0.0.0:33178}
2019-07-29 17:23:15,277 [myid:] - INFO  [main:Server@410] - Started @1579ms
2019-07-29 17:23:15,293 [myid:] - INFO  [main:AbstractConnector@341] - Stopped ServerConnector@45312be2{HTTP/1.1,[http/1.1]}{0.0.0.0:0}
2019-07-29 17:23:15,295 [myid:] - INFO  [main:ContextHandler@1045] - Stopped o.e.j.s.ServletContextHandler@d62fe5b{/,null,UNAVAILABLE}
2019-07-29 17:23:15,297 [myid:] - INFO  [main:PrometheusMetricsProvider@74] - Initializing
metrics, configuration: {exportJvmInfo=false, httpPort=0}
2019-07-29 17:23:15,297 [myid:] - INFO  [main:PrometheusMetricsProvider@82] - Starting /metrics
HTTP endpoint at port 0 exportJvmInfo: false
2019-07-29 17:23:15,298 [myid:] - INFO  [main:Server@370] - jetty-9.4.18.v20190429; built:
2019-04-29T20:42:08.989Z; git: e1bc35120a6617ee3df052294e433f3a25ce7097; jvm 1.8.0_191-b12
2019-07-29 17:23:15,301 [myid:] - INFO  [main:ContextHandler@855] - Started o.e.j.s.ServletContextHandler@65a15628{/,null,AVAILABLE}
2019-07-29 17:23:15,333 [myid:] - INFO  [main:AbstractConnector@292] - Started ServerConnector@1a20270e{HTTP/1.1,[http/1.1]}{0.0.0.0:37827}
2019-07-29 17:23:15,333 [myid:] - INFO  [main:Server@410] - Started @1636ms
2019-07-29 17:23:15,339 [myid:] - ERROR [main:PrometheusMetricsProvider$PrometheusCounter@285]
- invalid delta -1 for metric cc
java.lang.IllegalArgumentException: Amount to increment must be non-negative.
	at io.prometheus.client.Counter$Child.inc(Counter.java:123)
	at io.prometheus.client.Counter.inc(Counter.java:147)
	at org.apache.zookeeper.metrics.prometheus.PrometheusMetricsProvider$PrometheusCounter.add(PrometheusMetricsProvider.java:283)
	at org.apache.zookeeper.metrics.prometheus.PrometheusMetricsProviderTest.testCounters(PrometheusMetricsProviderTest.java:88)
	at sun.reflect.NativeMethodAccessorImpl.invoke0(Native Method)
	at sun.reflect.NativeMethodAccessorImpl.invoke(NativeMethodAccessorImpl.java:62)
	at sun.reflect.DelegatingMethodAccessorImpl.invoke(DelegatingMethodAccessorImpl.java:43)
	at java.lang.reflect.Method.invoke(Method.java:498)
	at org.junit.runners.model.FrameworkMethod$1.runReflectiveCall(FrameworkMethod.java:50)
	at org.junit.internal.runners.model.ReflectiveCallable.run(ReflectiveCallable.java:12)
	at org.junit.runners.model.FrameworkMethod.invokeExplosively(FrameworkMethod.java:47)
	at org.junit.internal.runners.statements.InvokeMethod.evaluate(InvokeMethod.java:17)
	at org.junit.internal.runners.statements.RunBefores.evaluate(RunBefores.java:26)
	at org.junit.internal.runners.statements.RunAfters.evaluate(RunAfters.java:27)
	at org.junit.runners.ParentRunner.runLeaf(ParentRunner.java:325)
	at org.junit.runners.BlockJUnit4ClassRunner.runChild(BlockJUnit4ClassRunner.java:78)
	at org.junit.runners.BlockJUnit4ClassRunner.runChild(BlockJUnit4ClassRunner.java:57)
	at org.junit.runners.ParentRunner$3.run(ParentRunner.java:290)
	at org.junit.runners.ParentRunner$1.schedule(ParentRunner.java:71)
	at org.junit.runners.ParentRunner.runChildren(ParentRunner.java:288)
	at org.junit.runners.ParentRunner.access$000(ParentRunner.java:58)
	at org.junit.runners.ParentRunner$2.evaluate(ParentRunner.java:268)
	at org.junit.runners.ParentRunner.run(ParentRunner.java:363)
	at org.apache.maven.surefire.junit4.JUnit4Provider.execute(JUnit4Provider.java:365)
	at org.apache.maven.surefire.junit4.JUnit4Provider.executeWithRerun(JUnit4Provider.java:273)
	at org.apache.maven.surefire.junit4.JUnit4Provider.executeTestSet(JUnit4Provider.java:238)
	at org.apache.maven.surefire.junit4.JUnit4Provider.invoke(JUnit4Provider.java:159)
	at org.apache.maven.surefire.booter.ForkedBooter.invokeProviderInSameClassLoader(ForkedBooter.java:384)
	at org.apache.maven.surefire.booter.ForkedBooter.runSuitesInProcess(ForkedBooter.java:345)
	at org.apache.maven.surefire.booter.ForkedBooter.execute(ForkedBooter.java:126)
	at org.apache.maven.surefire.booter.ForkedBooter.main(ForkedBooter.java:418)
2019-07-29 17:23:15,349 [myid:] - INFO  [main:AbstractConnector@341] - Stopped ServerConnector@1a20270e{HTTP/1.1,[http/1.1]}{0.0.0.0:0}
2019-07-29 17:23:15,350 [myid:] - INFO  [main:ContextHandler@1045] - Stopped o.e.j.s.ServletContextHandler@65a15628{/,null,UNAVAILABLE}
2019-07-29 17:23:15,352 [myid:] - INFO  [main:PrometheusMetricsProvider@74] - Initializing
metrics, configuration: {exportJvmInfo=false, httpPort=0}
2019-07-29 17:23:15,352 [myid:] - INFO  [main:PrometheusMetricsProvider@82] - Starting /metrics
HTTP endpoint at port 0 exportJvmInfo: false
2019-07-29 17:23:15,353 [myid:] - INFO  [main:Server@370] - jetty-9.4.18.v20190429; built:
2019-04-29T20:42:08.989Z; git: e1bc35120a6617ee3df052294e433f3a25ce7097; jvm 1.8.0_191-b12
2019-07-29 17:23:15,355 [myid:] - INFO  [main:ContextHandler@855] - Started o.e.j.s.ServletContextHandler@bcef303{/,null,AVAILABLE}
2019-07-29 17:23:15,361 [myid:] - INFO  [main:AbstractConnector@292] - Started ServerConnector@40db2a24{HTTP/1.1,[http/1.1]}{0.0.0.0:45360}
2019-07-29 17:23:15,362 [myid:] - INFO  [main:Server@410] - Started @1664ms
2019-07-29 17:23:15,368 [myid:] - INFO  [main:AbstractConnector@341] - Stopped ServerConnector@40db2a24{HTTP/1.1,[http/1.1]}{0.0.0.0:0}
2019-07-29 17:23:15,369 [myid:] - INFO  [main:ContextHandler@1045] - Stopped o.e.j.s.ServletContextHandler@bcef303{/,null,UNAVAILABLE}
[INFO] Tests run: 4, Failures: 0, Errors: 0, Skipped: 0, Time elapsed: 1.308 s - in org.apache.zookeeper.metrics.prometheus.PrometheusMetricsProviderTest
[INFO] Running org.apache.zookeeper.metrics.prometheus.ExportJvmInfoTest
2019-07-29 17:23:15,372 [myid:] - INFO  [main:PrometheusMetricsProvider@74] - Initializing
metrics, configuration: {exportJvmInfo=false, httpPort=0}
2019-07-29 17:23:15,373 [myid:] - INFO  [main:PrometheusMetricsProvider@82] - Starting /metrics
HTTP endpoint at port 0 exportJvmInfo: false
2019-07-29 17:23:15,373 [myid:] - INFO  [main:Server@370] - jetty-9.4.18.v20190429; built:
2019-04-29T20:42:08.989Z; git: e1bc35120a6617ee3df052294e433f3a25ce7097; jvm 1.8.0_191-b12
2019-07-29 17:23:15,375 [myid:] - INFO  [main:ContextHandler@855] - Started o.e.j.s.ServletContextHandler@344f4dea{/,null,AVAILABLE}
2019-07-29 17:23:15,381 [myid:] - INFO  [main:AbstractConnector@292] - Started ServerConnector@5443d039{HTTP/1.1,[http/1.1]}{0.0.0.0:38104}
2019-07-29 17:23:15,381 [myid:] - INFO  [main:Server@410] - Started @1684ms
2019-07-29 17:23:15,385 [myid:] - INFO  [main:AbstractConnector@341] - Stopped ServerConnector@5443d039{HTTP/1.1,[http/1.1]}{0.0.0.0:0}
2019-07-29 17:23:15,385 [myid:] - INFO  [main:ContextHandler@1045] - Stopped o.e.j.s.ServletContextHandler@344f4dea{/,null,UNAVAILABLE}
2019-07-29 17:23:15,387 [myid:] - INFO  [main:PrometheusMetricsProvider@74] - Initializing
metrics, configuration: {exportJvmInfo=true, httpPort=0}
2019-07-29 17:23:15,388 [myid:] - INFO  [main:PrometheusMetricsProvider@82] - Starting /metrics
HTTP endpoint at port 0 exportJvmInfo: true
2019-07-29 17:23:15,409 [myid:] - INFO  [main:Server@370] - jetty-9.4.18.v20190429; built:
2019-04-29T20:42:08.989Z; git: e1bc35120a6617ee3df052294e433f3a25ce7097; jvm 1.8.0_191-b12
2019-07-29 17:23:15,411 [myid:] - INFO  [main:ContextHandler@855] - Started o.e.j.s.ServletContextHandler@74bada02{/,null,AVAILABLE}
2019-07-29 17:23:15,417 [myid:] - INFO  [main:AbstractConnector@292] - Started ServerConnector@77825085{HTTP/1.1,[http/1.1]}{0.0.0.0:43094}
2019-07-29 17:23:15,417 [myid:] - INFO  [main:Server@410] - Started @1720ms
2019-07-29 17:23:15,425 [myid:] - INFO  [main:AbstractConnector@341] - Stopped ServerConnector@77825085{HTTP/1.1,[http/1.1]}{0.0.0.0:0}
2019-07-29 17:23:15,425 [myid:] - INFO  [main:ContextHandler@1045] - Stopped o.e.j.s.ServletContextHandler@74bada02{/,null,UNAVAILABLE}
[INFO] Tests run: 2, Failures: 0, Errors: 0, Skipped: 0, Time elapsed: 0.052 s - in org.apache.zookeeper.metrics.prometheus.ExportJvmInfoTest
[INFO] 
[INFO] Results:
[INFO] 
[INFO] Tests run: 6, Failures: 0, Errors: 0, Skipped: 0
[INFO] 
[JENKINS] Recording test results
[INFO] 
[INFO] --- maven-jar-plugin:3.1.0:jar (default-jar) @ zookeeper-prometheus-metrics ---
[INFO] Building jar: <https://builds.apache.org/job/PreCommit-ZOOKEEPER-github-pr-build-maven/ws/zookeeper-metrics-providers/zookeeper-prometheus-metrics/target/zookeeper-prometheus-metrics-3.6.0-SNAPSHOT.jar>
[INFO] 
[INFO] --- maven-site-plugin:3.5.1:attach-descriptor (attach-descriptor) @ zookeeper-prometheus-metrics
---
[INFO] 
[INFO] --- maven-jar-plugin:3.1.0:test-jar (Jar Tests Package) @ zookeeper-prometheus-metrics
---
[INFO] Building jar: <https://builds.apache.org/job/PreCommit-ZOOKEEPER-github-pr-build-maven/ws/zookeeper-metrics-providers/zookeeper-prometheus-metrics/target/zookeeper-prometheus-metrics-3.6.0-SNAPSHOT-tests.jar>
[INFO] 
[INFO] >>> maven-source-plugin:3.0.1:jar (attach-sources) > generate-sources @
zookeeper-prometheus-metrics >>>
[INFO] 
[INFO] --- git-commit-id-plugin:3.0.0:revision (find-current-git-revision) @ zookeeper-prometheus-metrics
---
[INFO] 
[INFO] --- maven-antrun-plugin:1.8:run (default) @ zookeeper-prometheus-metrics ---
[INFO] Executing tasks

main:
[INFO] Executed tasks
[WARNING] Failed to getClass for org.apache.maven.plugins.source.SourceJarMojo
[INFO] 
[INFO] <<< maven-source-plugin:3.0.1:jar (attach-sources) < generate-sources @
zookeeper-prometheus-metrics <<<
[INFO] 
[INFO] 
[INFO] --- maven-source-plugin:3.0.1:jar (attach-sources) @ zookeeper-prometheus-metrics ---
[INFO] Building jar: <https://builds.apache.org/job/PreCommit-ZOOKEEPER-github-pr-build-maven/ws/zookeeper-metrics-providers/zookeeper-prometheus-metrics/target/zookeeper-prometheus-metrics-3.6.0-SNAPSHOT-sources.jar>
[INFO] 
[INFO] --- maven-javadoc-plugin:3.0.1:jar (attach-javadocs) @ zookeeper-prometheus-metrics
---
[INFO] 
Loading source files for package org.apache.zookeeper.metrics.prometheus...
Constructing Javadoc information...
Standard Doclet version 1.8.0_191
Building tree for all the packages and classes...
Generating <https://builds.apache.org/job/PreCommit-ZOOKEEPER-github-pr-build-maven/ws/zookeeper-metrics-providers/zookeeper-prometheus-metrics/target/apidocs/org/apache/zookeeper/metrics/prometheus/PrometheusMetricsProvider.html...>
Generating <https://builds.apache.org/job/PreCommit-ZOOKEEPER-github-pr-build-maven/ws/zookeeper-metrics-providers/zookeeper-prometheus-metrics/target/apidocs/org/apache/zookeeper/metrics/prometheus/package-frame.html...>
Generating <https://builds.apache.org/job/PreCommit-ZOOKEEPER-github-pr-build-maven/ws/zookeeper-metrics-providers/zookeeper-prometheus-metrics/target/apidocs/org/apache/zookeeper/metrics/prometheus/package-summary.html...>
Generating <https://builds.apache.org/job/PreCommit-ZOOKEEPER-github-pr-build-maven/ws/zookeeper-metrics-providers/zookeeper-prometheus-metrics/target/apidocs/org/apache/zookeeper/metrics/prometheus/package-tree.html...>
Generating <https://builds.apache.org/job/PreCommit-ZOOKEEPER-github-pr-build-maven/ws/zookeeper-metrics-providers/zookeeper-prometheus-metrics/target/apidocs/constant-values.html...>
Generating <https://builds.apache.org/job/PreCommit-ZOOKEEPER-github-pr-build-maven/ws/zookeeper-metrics-providers/zookeeper-prometheus-metrics/target/apidocs/org/apache/zookeeper/metrics/prometheus/class-use/PrometheusMetricsProvider.html...>
Generating <https://builds.apache.org/job/PreCommit-ZOOKEEPER-github-pr-build-maven/ws/zookeeper-metrics-providers/zookeeper-prometheus-metrics/target/apidocs/org/apache/zookeeper/metrics/prometheus/package-use.html...>
Building index for all the packages and classes...
Generating <https://builds.apache.org/job/PreCommit-ZOOKEEPER-github-pr-build-maven/ws/zookeeper-metrics-providers/zookeeper-prometheus-metrics/target/apidocs/overview-tree.html...>
Generating <https://builds.apache.org/job/PreCommit-ZOOKEEPER-github-pr-build-maven/ws/zookeeper-metrics-providers/zookeeper-prometheus-metrics/target/apidocs/index-all.html...>
Generating <https://builds.apache.org/job/PreCommit-ZOOKEEPER-github-pr-build-maven/ws/zookeeper-metrics-providers/zookeeper-prometheus-metrics/target/apidocs/deprecated-list.html...>
Building index for all classes...
Generating <https://builds.apache.org/job/PreCommit-ZOOKEEPER-github-pr-build-maven/ws/zookeeper-metrics-providers/zookeeper-prometheus-metrics/target/apidocs/allclasses-frame.html...>
Generating <https://builds.apache.org/job/PreCommit-ZOOKEEPER-github-pr-build-maven/ws/zookeeper-metrics-providers/zookeeper-prometheus-metrics/target/apidocs/allclasses-noframe.html...>
Generating <https://builds.apache.org/job/PreCommit-ZOOKEEPER-github-pr-build-maven/ws/zookeeper-metrics-providers/zookeeper-prometheus-metrics/target/apidocs/index.html...>
Generating <https://builds.apache.org/job/PreCommit-ZOOKEEPER-github-pr-build-maven/ws/zookeeper-metrics-providers/zookeeper-prometheus-metrics/target/apidocs/help-doc.html...>
[INFO] Building jar: <https://builds.apache.org/job/PreCommit-ZOOKEEPER-github-pr-build-maven/ws/zookeeper-metrics-providers/zookeeper-prometheus-metrics/target/zookeeper-prometheus-metrics-3.6.0-SNAPSHOT-javadoc.jar>
[INFO] 
[INFO] --- checksum-maven-plugin:1.8:artifacts (default) @ zookeeper-prometheus-metrics ---
[INFO] zookeeper-prometheus-metrics-3.6.0-SNAPSHOT.jar - SHA-512 : 98dd833bac641c38d2fec2ac69d3a4b7cfecd629067eb65c6f48db80ebc12117d50e0d21fe5525c3fee734cf0b135ff8503a5c531739ab801a595ea223f81e15
[INFO] zookeeper-prometheus-metrics-3.6.0-SNAPSHOT-tests.jar - SHA-512 : af6d536846756745a4f586ccbbcf72e6b5e34dcbe09c1b373e2541a8723d7381b9aa14b0eaf1cd239dc45717950606f12b0fe97384a521d3d2293d8e622bde27
[INFO] zookeeper-prometheus-metrics-3.6.0-SNAPSHOT-sources.jar - SHA-512 : 6e69a3c3c40315dce444f1e158b703c98fe8d6f4f0e569b1dca76157c42ff4e45760de303c88e36b7aff6a3682ac4f1b3e7e9056bdcec7b6e1c27d5e3fcd2cfe
[INFO] zookeeper-prometheus-metrics-3.6.0-SNAPSHOT-javadoc.jar - SHA-512 : 58c221933644be9a6a4f8213e085b7c6c2425da1cd9106332bce1f8255d274950a1dd485eeb3ae21cb35263ebf7281da4efd07dc4eca0d882fef93c09adac5a2
[INFO] 
[INFO] >>> spotbugs-maven-plugin:3.1.9:check (default-cli) > :spotbugs @ zookeeper-prometheus-metrics
>>>
[INFO] 
[INFO] --- spotbugs-maven-plugin:3.1.9:spotbugs (spotbugs) @ zookeeper-prometheus-metrics
---
[INFO] Fork Value is true
     [java] SLF4J: No SLF4J providers were found.
     [java] SLF4J: Defaulting to no-operation (NOP) logger implementation
     [java] SLF4J: See http://www.slf4j.org/codes.html#noProviders for further details.
[INFO] Done SpotBugs Analysis....
[INFO] 
[INFO] <<< spotbugs-maven-plugin:3.1.9:check (default-cli) < :spotbugs @ zookeeper-prometheus-metrics
<<<
[INFO] 
[INFO] 
[INFO] --- spotbugs-maven-plugin:3.1.9:check (default-cli) @ zookeeper-prometheus-metrics
---
[INFO] BugInstance size is 0
[INFO] Error size is 0
[INFO] No errors/warnings found
[INFO] 
[INFO] --- maven-checkstyle-plugin:3.1.0:check (default-cli) @ zookeeper-prometheus-metrics
---
[INFO] Starting audit...
[ERROR] <https://builds.apache.org/job/PreCommit-ZOOKEEPER-github-pr-build-maven/ws/zookeeper-metrics-providers/zookeeper-prometheus-metrics/src/test/resources/log4j.properties>:2:
Trailing whitespace [RegexpSingleline]
[ERROR] <https://builds.apache.org/job/PreCommit-ZOOKEEPER-github-pr-build-maven/ws/zookeeper-metrics-providers/zookeeper-prometheus-metrics/src/test/resources/log4j.properties>:37:
Trailing whitespace [RegexpSingleline]
Audit done.
[INFO] There are 2 errors reported by Checkstyle 8.17 with checkstyle-strict.xml ruleset.
[ERROR] src/test/resources/log4j.properties:[2] (regexp) RegexpSingleline: Trailing whitespace
[ERROR] src/test/resources/log4j.properties:[37] (regexp) RegexpSingleline: Trailing whitespace
[INFO] ------------------------------------------------------------------------
[INFO] Reactor Summary for Apache ZooKeeper 3.6.0-SNAPSHOT:
[INFO] 
[INFO] Apache ZooKeeper ................................... SUCCESS [ 24.598 s]
[INFO] Apache ZooKeeper - Documentation ................... SUCCESS [  9.932 s]
[INFO] Apache ZooKeeper - Jute ............................ SUCCESS [01:38 min]
[INFO] Apache ZooKeeper - Server .......................... SUCCESS [15:59 min]
[INFO] Apache ZooKeeper - Metrics Providers ............... SUCCESS [  3.485 s]
[INFO] Apache ZooKeeper - Prometheus.io Metrics Provider .. FAILURE [ 14.241 s]
[INFO] Apache ZooKeeper - Client .......................... SKIPPED
[INFO] Apache ZooKeeper - Client - C ...................... SKIPPED
[INFO] Apache ZooKeeper - Recipes ......................... SKIPPED
[INFO] Apache ZooKeeper - Recipes - Election .............. SKIPPED
[INFO] Apache ZooKeeper - Recipes - Lock .................. SKIPPED
[INFO] Apache ZooKeeper - Recipes - Queue ................. SKIPPED
[INFO] Apache ZooKeeper - Assembly ........................ SKIPPED
[INFO] Apache ZooKeeper - Contrib ......................... SKIPPED
[INFO] Apache ZooKeeper - Contrib - Loggraph .............. SKIPPED
[INFO] Apache ZooKeeper - Contrib - Rest .................. SKIPPED
[INFO] Apache ZooKeeper - Contrib - ZooInspector .......... SKIPPED
[INFO] ------------------------------------------------------------------------
[INFO] BUILD FAILURE
[INFO] ------------------------------------------------------------------------
[INFO] Total time:  19:15 min
[INFO] Finished at: 2019-07-29T17:23:45Z
[INFO] ------------------------------------------------------------------------
Waiting for Jenkins to finish collecting data
[ERROR] Failed to execute goal org.apache.maven.plugins:maven-checkstyle-plugin:3.1.0:check
(default-cli) on project zookeeper-prometheus-metrics: You have 2 Checkstyle violations. ->
[Help 1]
[ERROR] 
[ERROR] To see the full stack trace of the errors, re-run Maven with the -e switch.
[ERROR] Re-run Maven using the -X switch to enable full debug logging.
[ERROR] 
[ERROR] For more information about the errors and possible solutions, please read the following
articles:
[ERROR] [Help 1] http://cwiki.apache.org/confluence/display/MAVEN/MojoFailureException
[ERROR] 
[ERROR] After correcting the problems, you can resume the build with the command
[ERROR]   mvn <goals> -rf :zookeeper-prometheus-metrics
[JENKINS] Archiving <https://builds.apache.org/job/PreCommit-ZOOKEEPER-github-pr-build-maven/ws/zookeeper-server/pom.xml>
to org.apache.zookeeper/zookeeper/3.6.0-SNAPSHOT/zookeeper-3.6.0-SNAPSHOT.pom
[JENKINS] Archiving <https://builds.apache.org/job/PreCommit-ZOOKEEPER-github-pr-build-maven/ws/zookeeper-server/target/zookeeper-3.6.0-SNAPSHOT.jar>
to org.apache.zookeeper/zookeeper/3.6.0-SNAPSHOT/zookeeper-3.6.0-SNAPSHOT.jar
[JENKINS] Archiving <https://builds.apache.org/job/PreCommit-ZOOKEEPER-github-pr-build-maven/ws/zookeeper-server/target/zookeeper-3.6.0-SNAPSHOT-tests.jar>
to org.apache.zookeeper/zookeeper/3.6.0-SNAPSHOT/zookeeper-3.6.0-SNAPSHOT-tests.jar
[JENKINS] Archiving <https://builds.apache.org/job/PreCommit-ZOOKEEPER-github-pr-build-maven/ws/zookeeper-server/target/zookeeper-3.6.0-SNAPSHOT-sources.jar>
to org.apache.zookeeper/zookeeper/3.6.0-SNAPSHOT/zookeeper-3.6.0-SNAPSHOT-sources.jar
[JENKINS] Archiving <https://builds.apache.org/job/PreCommit-ZOOKEEPER-github-pr-build-maven/ws/zookeeper-server/target/zookeeper-3.6.0-SNAPSHOT-javadoc.jar>
to org.apache.zookeeper/zookeeper/3.6.0-SNAPSHOT/zookeeper-3.6.0-SNAPSHOT-javadoc.jar
[JENKINS] Archiving <https://builds.apache.org/job/PreCommit-ZOOKEEPER-github-pr-build-maven/ws/zookeeper-contrib/zookeeper-contrib-loggraph/pom.xml>
to org.apache.zookeeper/zookeeper-contrib-loggraph/3.6.0-SNAPSHOT/zookeeper-contrib-loggraph-3.6.0-SNAPSHOT.pom
[JENKINS] Archiving <https://builds.apache.org/job/PreCommit-ZOOKEEPER-github-pr-build-maven/ws/zookeeper-metrics-providers/pom.xml>
to org.apache.zookeeper/zookeeper-metrics-providers/3.6.0-SNAPSHOT/zookeeper-metrics-providers-3.6.0-SNAPSHOT.pom
[JENKINS] Archiving <https://builds.apache.org/job/PreCommit-ZOOKEEPER-github-pr-build-maven/ws/zookeeper-metrics-providers/zookeeper-prometheus-metrics/pom.xml>
to org.apache.zookeeper/zookeeper-prometheus-metrics/3.6.0-SNAPSHOT/zookeeper-prometheus-metrics-3.6.0-SNAPSHOT.pom
[JENKINS] Archiving <https://builds.apache.org/job/PreCommit-ZOOKEEPER-github-pr-build-maven/ws/zookeeper-metrics-providers/zookeeper-prometheus-metrics/target/zookeeper-prometheus-metrics-3.6.0-SNAPSHOT.jar>
to org.apache.zookeeper/zookeeper-prometheus-metrics/3.6.0-SNAPSHOT/zookeeper-prometheus-metrics-3.6.0-SNAPSHOT.jar
[JENKINS] Archiving <https://builds.apache.org/job/PreCommit-ZOOKEEPER-github-pr-build-maven/ws/zookeeper-metrics-providers/zookeeper-prometheus-metrics/target/zookeeper-prometheus-metrics-3.6.0-SNAPSHOT-tests.jar>
to org.apache.zookeeper/zookeeper-prometheus-metrics/3.6.0-SNAPSHOT/zookeeper-prometheus-metrics-3.6.0-SNAPSHOT-tests.jar
[JENKINS] Archiving <https://builds.apache.org/job/PreCommit-ZOOKEEPER-github-pr-build-maven/ws/zookeeper-metrics-providers/zookeeper-prometheus-metrics/target/zookeeper-prometheus-metrics-3.6.0-SNAPSHOT-sources.jar>
to org.apache.zookeeper/zookeeper-prometheus-metrics/3.6.0-SNAPSHOT/zookeeper-prometheus-metrics-3.6.0-SNAPSHOT-sources.jar
[JENKINS] Archiving <https://builds.apache.org/job/PreCommit-ZOOKEEPER-github-pr-build-maven/ws/zookeeper-metrics-providers/zookeeper-prometheus-metrics/target/zookeeper-prometheus-metrics-3.6.0-SNAPSHOT-javadoc.jar>
to org.apache.zookeeper/zookeeper-prometheus-metrics/3.6.0-SNAPSHOT/zookeeper-prometheus-metrics-3.6.0-SNAPSHOT-javadoc.jar
[JENKINS] Archiving <https://builds.apache.org/job/PreCommit-ZOOKEEPER-github-pr-build-maven/ws/zookeeper-recipes/zookeeper-recipes-election/pom.xml>
to org.apache.zookeeper/zookeeper-recipes-election/3.6.0-SNAPSHOT/zookeeper-recipes-election-3.6.0-SNAPSHOT.pom
[JENKINS] Archiving <https://builds.apache.org/job/PreCommit-ZOOKEEPER-github-pr-build-maven/ws/pom.xml>
to org.apache.zookeeper/parent/3.6.0-SNAPSHOT/parent-3.6.0-SNAPSHOT.pom
[JENKINS] Archiving <https://builds.apache.org/job/PreCommit-ZOOKEEPER-github-pr-build-maven/ws/zookeeper-recipes/zookeeper-recipes-lock/pom.xml>
to org.apache.zookeeper/zookeeper-recipes-lock/3.6.0-SNAPSHOT/zookeeper-recipes-lock-3.6.0-SNAPSHOT.pom
[JENKINS] Archiving <https://builds.apache.org/job/PreCommit-ZOOKEEPER-github-pr-build-maven/ws/zookeeper-contrib/pom.xml>
to org.apache.zookeeper/zookeeper-contrib/3.6.0-SNAPSHOT/zookeeper-contrib-3.6.0-SNAPSHOT.pom
[JENKINS] Archiving <https://builds.apache.org/job/PreCommit-ZOOKEEPER-github-pr-build-maven/ws/zookeeper-client/pom.xml>
to org.apache.zookeeper/zookeeper-client/3.6.0-SNAPSHOT/zookeeper-client-3.6.0-SNAPSHOT.pom
[JENKINS] Archiving <https://builds.apache.org/job/PreCommit-ZOOKEEPER-github-pr-build-maven/ws/zookeeper-jute/pom.xml>
to org.apache.zookeeper/zookeeper-jute/3.6.0-SNAPSHOT/zookeeper-jute-3.6.0-SNAPSHOT.pom
[JENKINS] Archiving <https://builds.apache.org/job/PreCommit-ZOOKEEPER-github-pr-build-maven/ws/zookeeper-jute/target/zookeeper-jute-3.6.0-SNAPSHOT.jar>
to org.apache.zookeeper/zookeeper-jute/3.6.0-SNAPSHOT/zookeeper-jute-3.6.0-SNAPSHOT.jar
[JENKINS] Archiving <https://builds.apache.org/job/PreCommit-ZOOKEEPER-github-pr-build-maven/ws/zookeeper-jute/target/zookeeper-jute-3.6.0-SNAPSHOT-tests.jar>
to org.apache.zookeeper/zookeeper-jute/3.6.0-SNAPSHOT/zookeeper-jute-3.6.0-SNAPSHOT-tests.jar
[JENKINS] Archiving <https://builds.apache.org/job/PreCommit-ZOOKEEPER-github-pr-build-maven/ws/zookeeper-jute/target/zookeeper-jute-3.6.0-SNAPSHOT-sources.jar>
to org.apache.zookeeper/zookeeper-jute/3.6.0-SNAPSHOT/zookeeper-jute-3.6.0-SNAPSHOT-sources.jar
[JENKINS] Archiving <https://builds.apache.org/job/PreCommit-ZOOKEEPER-github-pr-build-maven/ws/zookeeper-jute/target/zookeeper-jute-3.6.0-SNAPSHOT-javadoc.jar>
to org.apache.zookeeper/zookeeper-jute/3.6.0-SNAPSHOT/zookeeper-jute-3.6.0-SNAPSHOT-javadoc.jar
[JENKINS] Archiving <https://builds.apache.org/job/PreCommit-ZOOKEEPER-github-pr-build-maven/ws/zookeeper-recipes/zookeeper-recipes-queue/pom.xml>
to org.apache.zookeeper/zookeeper-recipes-queue/3.6.0-SNAPSHOT/zookeeper-recipes-queue-3.6.0-SNAPSHOT.pom
[JENKINS] Archiving <https://builds.apache.org/job/PreCommit-ZOOKEEPER-github-pr-build-maven/ws/zookeeper-docs/pom.xml>
to org.apache.zookeeper/zookeeper-docs/3.6.0-SNAPSHOT/zookeeper-docs-3.6.0-SNAPSHOT.pom
[JENKINS] Archiving <https://builds.apache.org/job/PreCommit-ZOOKEEPER-github-pr-build-maven/ws/zookeeper-docs/target/zookeeper-docs-3.6.0-SNAPSHOT.jar>
to org.apache.zookeeper/zookeeper-docs/3.6.0-SNAPSHOT/zookeeper-docs-3.6.0-SNAPSHOT.jar
[JENKINS] Archiving <https://builds.apache.org/job/PreCommit-ZOOKEEPER-github-pr-build-maven/ws/zookeeper-docs/target/zookeeper-docs-3.6.0-SNAPSHOT-tests.jar>
to org.apache.zookeeper/zookeeper-docs/3.6.0-SNAPSHOT/zookeeper-docs-3.6.0-SNAPSHOT-tests.jar
[JENKINS] Archiving <https://builds.apache.org/job/PreCommit-ZOOKEEPER-github-pr-build-maven/ws/zookeeper-docs/target/zookeeper-docs-3.6.0-SNAPSHOT-sources.jar>
to org.apache.zookeeper/zookeeper-docs/3.6.0-SNAPSHOT/zookeeper-docs-3.6.0-SNAPSHOT-sources.jar
[JENKINS] Archiving <https://builds.apache.org/job/PreCommit-ZOOKEEPER-github-pr-build-maven/ws/zookeeper-recipes/pom.xml>
to org.apache.zookeeper/zookeeper-recipes/3.6.0-SNAPSHOT/zookeeper-recipes-3.6.0-SNAPSHOT.pom
[JENKINS] Archiving <https://builds.apache.org/job/PreCommit-ZOOKEEPER-github-pr-build-maven/ws/zookeeper-client/zookeeper-client-c/pom.xml>
to org.apache.zookeeper/zookeeper-client-c/3.6.0-SNAPSHOT/zookeeper-client-c-3.6.0-SNAPSHOT.pom
[JENKINS] Archiving <https://builds.apache.org/job/PreCommit-ZOOKEEPER-github-pr-build-maven/ws/zookeeper-contrib/zookeeper-contrib-rest/pom.xml>
to org.apache.zookeeper/zookeeper-contrib-rest/3.6.0-SNAPSHOT/zookeeper-contrib-rest-3.6.0-SNAPSHOT.pom
[JENKINS] Archiving <https://builds.apache.org/job/PreCommit-ZOOKEEPER-github-pr-build-maven/ws/zookeeper-assembly/pom.xml>
to org.apache.zookeeper/zookeeper-assembly/3.6.0-SNAPSHOT/zookeeper-assembly-3.6.0-SNAPSHOT.pom
[JENKINS] Archiving <https://builds.apache.org/job/PreCommit-ZOOKEEPER-github-pr-build-maven/ws/zookeeper-contrib/zookeeper-contrib-zooinspector/pom.xml>
to org.apache.zookeeper/zookeeper-contrib-zooinspector/3.6.0-SNAPSHOT/zookeeper-contrib-zooinspector-3.6.0-SNAPSHOT.pom
channel stopped
[SpotBugs] Skipping execution of recorder since overall result is 'FAILURE'
Setting status of bfeda47d8f1dc42427f16f3a30418935c77a81f9 to FAILURE with url https://builds.apache.org/job/PreCommit-ZOOKEEPER-github-pr-build-maven/1003/
and message: 'FAILURE
 '
Using context: JenkinsMaven

Mime
View raw message