zookeeper-dev mailing list archives

Site index · List index
Message view « Date » · « Thread »
Top « Date » · « Thread »
From Apache Jenkins Server <jenk...@builds.apache.org>
Subject Build failed in Jenkins: zookeeper-master-maven-owasp #21
Date Tue, 02 Jul 2019 23:31:47 GMT
See <https://builds.apache.org/job/zookeeper-master-maven-owasp/21/display/redirect?page=changes>

Changes:

[hanm] ZOOKEEPER-3439: Observability improvements on client / server connection

------------------------------------------
[...truncated 592.26 KB...]
[INFO] Downloading from central: https://repo.maven.apache.org/maven2/xml-apis/xml-apis/1.3.04/xml-apis-1.3.04.pom
[INFO] Downloaded from central: https://repo.maven.apache.org/maven2/xml-apis/xml-apis/1.3.04/xml-apis-1.3.04.pom
(1.8 kB at 182 kB/s)
[INFO] Downloading from central: https://repo.maven.apache.org/maven2/org/apache/maven/doxia/doxia-site-renderer/1.2/doxia-site-renderer-1.2.pom
[INFO] Downloaded from central: https://repo.maven.apache.org/maven2/org/apache/maven/doxia/doxia-site-renderer/1.2/doxia-site-renderer-1.2.pom
(6.2 kB at 520 kB/s)
[INFO] Downloading from central: https://repo.maven.apache.org/maven2/org/apache/maven/doxia/doxia-sitetools/1.2/doxia-sitetools-1.2.pom
[INFO] Downloaded from central: https://repo.maven.apache.org/maven2/org/apache/maven/doxia/doxia-sitetools/1.2/doxia-sitetools-1.2.pom
(16 kB at 1.2 MB/s)
[INFO] Downloading from central: https://repo.maven.apache.org/maven2/org/apache/maven/doxia/doxia-decoration-model/1.2/doxia-decoration-model-1.2.pom
[INFO] Downloaded from central: https://repo.maven.apache.org/maven2/org/apache/maven/doxia/doxia-decoration-model/1.2/doxia-decoration-model-1.2.pom
(3.1 kB at 255 kB/s)
[INFO] Downloading from central: https://repo.maven.apache.org/maven2/org/apache/maven/doxia/doxia-module-xhtml/1.2/doxia-module-xhtml-1.2.pom
[INFO] Downloaded from central: https://repo.maven.apache.org/maven2/org/apache/maven/doxia/doxia-module-xhtml/1.2/doxia-module-xhtml-1.2.pom
(1.8 kB at 160 kB/s)
[INFO] Downloading from central: https://repo.maven.apache.org/maven2/org/apache/maven/doxia/doxia-modules/1.2/doxia-modules-1.2.pom
[INFO] Downloaded from central: https://repo.maven.apache.org/maven2/org/apache/maven/doxia/doxia-modules/1.2/doxia-modules-1.2.pom
(2.5 kB at 227 kB/s)
[INFO] Downloading from central: https://repo.maven.apache.org/maven2/org/apache/maven/doxia/doxia-module-fml/1.2/doxia-module-fml-1.2.pom
[INFO] Downloaded from central: https://repo.maven.apache.org/maven2/org/apache/maven/doxia/doxia-module-fml/1.2/doxia-module-fml-1.2.pom
(5.6 kB at 511 kB/s)
[INFO] Downloading from central: https://repo.maven.apache.org/maven2/org/codehaus/plexus/plexus-velocity/1.1.7/plexus-velocity-1.1.7.pom
[INFO] Downloaded from central: https://repo.maven.apache.org/maven2/org/codehaus/plexus/plexus-velocity/1.1.7/plexus-velocity-1.1.7.pom
(2.0 kB at 196 kB/s)
[INFO] Downloading from central: https://repo.maven.apache.org/maven2/org/codehaus/plexus/plexus-container-default/1.0-alpha-20/plexus-container-default-1.0-alpha-20.pom
[INFO] Downloaded from central: https://repo.maven.apache.org/maven2/org/codehaus/plexus/plexus-container-default/1.0-alpha-20/plexus-container-default-1.0-alpha-20.pom
(3.0 kB at 299 kB/s)
[INFO] Downloading from central: https://repo.maven.apache.org/maven2/org/codehaus/plexus/plexus-containers/1.0-alpha-20/plexus-containers-1.0-alpha-20.pom
[INFO] Downloaded from central: https://repo.maven.apache.org/maven2/org/codehaus/plexus/plexus-containers/1.0-alpha-20/plexus-containers-1.0-alpha-20.pom
(1.9 kB at 171 kB/s)
[INFO] Downloading from central: https://repo.maven.apache.org/maven2/org/codehaus/plexus/plexus-utils/1.3/plexus-utils-1.3.pom
[INFO] Downloaded from central: https://repo.maven.apache.org/maven2/org/codehaus/plexus/plexus-utils/1.3/plexus-utils-1.3.pom
(1.0 kB at 86 kB/s)
[INFO] Downloading from central: https://repo.maven.apache.org/maven2/org/codehaus/plexus/plexus/1.0.8/plexus-1.0.8.pom
[INFO] Downloaded from central: https://repo.maven.apache.org/maven2/org/codehaus/plexus/plexus/1.0.8/plexus-1.0.8.pom
(7.2 kB at 657 kB/s)
[INFO] Downloading from central: https://repo.maven.apache.org/maven2/org/codehaus/plexus/plexus-classworlds/1.2-alpha-7/plexus-classworlds-1.2-alpha-7.pom
[INFO] Downloaded from central: https://repo.maven.apache.org/maven2/org/codehaus/plexus/plexus-classworlds/1.2-alpha-7/plexus-classworlds-1.2-alpha-7.pom
(2.4 kB at 216 kB/s)
[INFO] Downloading from central: https://repo.maven.apache.org/maven2/org/apache/velocity/velocity/1.5/velocity-1.5.pom
[INFO] Downloaded from central: https://repo.maven.apache.org/maven2/org/apache/velocity/velocity/1.5/velocity-1.5.pom
(7.8 kB at 706 kB/s)
[INFO] Downloading from central: https://repo.maven.apache.org/maven2/commons-lang/commons-lang/2.1/commons-lang-2.1.pom
[INFO] Downloaded from central: https://repo.maven.apache.org/maven2/commons-lang/commons-lang/2.1/commons-lang-2.1.pom
(9.9 kB at 827 kB/s)
[INFO] Downloading from central: https://repo.maven.apache.org/maven2/org/apache/maven/doxia/doxia-sink-api/1.4/doxia-sink-api-1.4.pom
[INFO] Downloaded from central: https://repo.maven.apache.org/maven2/org/apache/maven/doxia/doxia-sink-api/1.4/doxia-sink-api-1.4.pom
(1.5 kB at 139 kB/s)
[INFO] Downloading from central: https://repo.maven.apache.org/maven2/org/apache/maven/doxia/doxia/1.4/doxia-1.4.pom
[INFO] Downloaded from central: https://repo.maven.apache.org/maven2/org/apache/maven/doxia/doxia/1.4/doxia-1.4.pom
(18 kB at 1.4 MB/s)
[INFO] Downloading from central: https://repo.maven.apache.org/maven2/org/apache/maven/doxia/doxia-logging-api/1.4/doxia-logging-api-1.4.pom
[INFO] Downloaded from central: https://repo.maven.apache.org/maven2/org/apache/maven/doxia/doxia-logging-api/1.4/doxia-logging-api-1.4.pom
(1.5 kB at 128 kB/s)
[INFO] Downloading from central: https://repo.maven.apache.org/maven2/org/apache/maven/doxia/doxia-site-renderer/1.4/doxia-site-renderer-1.4.pom
[INFO] Downloaded from central: https://repo.maven.apache.org/maven2/org/apache/maven/doxia/doxia-site-renderer/1.4/doxia-site-renderer-1.4.pom
(6.1 kB at 556 kB/s)
[INFO] Downloading from central: https://repo.maven.apache.org/maven2/org/apache/maven/doxia/doxia-sitetools/1.4/doxia-sitetools-1.4.pom
[INFO] Downloaded from central: https://repo.maven.apache.org/maven2/org/apache/maven/doxia/doxia-sitetools/1.4/doxia-sitetools-1.4.pom
(17 kB at 1.3 MB/s)
[INFO] Downloading from central: https://repo.maven.apache.org/maven2/org/apache/maven/doxia/doxia-core/1.4/doxia-core-1.4.pom
[INFO] Downloaded from central: https://repo.maven.apache.org/maven2/org/apache/maven/doxia/doxia-core/1.4/doxia-core-1.4.pom
(4.1 kB at 370 kB/s)
[INFO] Downloading from central: https://repo.maven.apache.org/maven2/org/apache/maven/doxia/doxia-decoration-model/1.4/doxia-decoration-model-1.4.pom
[INFO] Downloaded from central: https://repo.maven.apache.org/maven2/org/apache/maven/doxia/doxia-decoration-model/1.4/doxia-decoration-model-1.4.pom
(2.7 kB at 206 kB/s)
[INFO] Downloading from central: https://repo.maven.apache.org/maven2/org/apache/maven/doxia/doxia-module-xhtml/1.4/doxia-module-xhtml-1.4.pom
[INFO] Downloaded from central: https://repo.maven.apache.org/maven2/org/apache/maven/doxia/doxia-module-xhtml/1.4/doxia-module-xhtml-1.4.pom
(1.6 kB at 148 kB/s)
[INFO] Downloading from central: https://repo.maven.apache.org/maven2/org/apache/maven/doxia/doxia-modules/1.4/doxia-modules-1.4.pom
[INFO] Downloaded from central: https://repo.maven.apache.org/maven2/org/apache/maven/doxia/doxia-modules/1.4/doxia-modules-1.4.pom
(2.6 kB at 238 kB/s)
[INFO] Downloading from central: https://repo.maven.apache.org/maven2/org/apache/maven/doxia/doxia-module-fml/1.4/doxia-module-fml-1.4.pom
[INFO] Downloaded from central: https://repo.maven.apache.org/maven2/org/apache/maven/doxia/doxia-module-fml/1.4/doxia-module-fml-1.4.pom
(4.8 kB at 437 kB/s)
[INFO] Downloading from central: https://repo.maven.apache.org/maven2/org/apache/maven/shared/maven-dependency-analyzer/1.10/maven-dependency-analyzer-1.10.pom
[INFO] Downloaded from central: https://repo.maven.apache.org/maven2/org/apache/maven/shared/maven-dependency-analyzer/1.10/maven-dependency-analyzer-1.10.pom
(6.7 kB at 518 kB/s)
[INFO] Downloading from central: https://repo.maven.apache.org/maven2/org/apache/maven/shared/maven-shared-components/31/maven-shared-components-31.pom
[INFO] Downloaded from central: https://repo.maven.apache.org/maven2/org/apache/maven/shared/maven-shared-components/31/maven-shared-components-31.pom
(5.1 kB at 426 kB/s)
[INFO] Downloading from central: https://repo.maven.apache.org/maven2/org/codehaus/plexus/plexus-utils/1.5.1/plexus-utils-1.5.1.pom
[INFO] Downloaded from central: https://repo.maven.apache.org/maven2/org/codehaus/plexus/plexus-utils/1.5.1/plexus-utils-1.5.1.pom
(2.3 kB at 209 kB/s)
[INFO] Downloading from central: https://repo.maven.apache.org/maven2/org/apache/maven/maven-model/2.0.5/maven-model-2.0.5.pom
[INFO] Downloaded from central: https://repo.maven.apache.org/maven2/org/apache/maven/maven-model/2.0.5/maven-model-2.0.5.pom
(2.7 kB at 181 kB/s)
[INFO] Downloading from central: https://repo.maven.apache.org/maven2/org/apache/maven/maven/2.0.5/maven-2.0.5.pom
[INFO] Downloaded from central: https://repo.maven.apache.org/maven2/org/apache/maven/maven/2.0.5/maven-2.0.5.pom
(5.7 kB at 475 kB/s)
[INFO] Downloading from central: https://repo.maven.apache.org/maven2/org/apache/maven/maven-artifact/2.0.5/maven-artifact-2.0.5.pom
[INFO] Downloaded from central: https://repo.maven.apache.org/maven2/org/apache/maven/maven-artifact/2.0.5/maven-artifact-2.0.5.pom
(727 B at 61 kB/s)
[INFO] Downloading from central: https://repo.maven.apache.org/maven2/org/apache/maven/reporting/maven-reporting-impl/2.3/maven-reporting-impl-2.3.jar
[INFO] Downloading from central: https://repo.maven.apache.org/maven2/org/apache/maven/doxia/doxia-core/1.2/doxia-core-1.2.jar
[INFO] Downloading from central: https://repo.maven.apache.org/maven2/xerces/xercesImpl/2.9.1/xercesImpl-2.9.1.jar
[INFO] Downloading from central: https://repo.maven.apache.org/maven2/xml-apis/xml-apis/1.3.04/xml-apis-1.3.04.jar
[INFO] Downloading from central: https://repo.maven.apache.org/maven2/org/apache/maven/doxia/doxia-sink-api/1.4/doxia-sink-api-1.4.jar
[INFO] Downloaded from central: https://repo.maven.apache.org/maven2/org/apache/maven/reporting/maven-reporting-impl/2.3/maven-reporting-impl-2.3.jar
(18 kB at 899 kB/s)
[INFO] Downloading from central: https://repo.maven.apache.org/maven2/org/apache/maven/doxia/doxia-logging-api/1.4/doxia-logging-api-1.4.jar
[INFO] Downloaded from central: https://repo.maven.apache.org/maven2/org/apache/maven/doxia/doxia-sink-api/1.4/doxia-sink-api-1.4.jar
(11 kB at 467 kB/s)
[INFO] Downloading from central: https://repo.maven.apache.org/maven2/org/apache/maven/doxia/doxia-site-renderer/1.4/doxia-site-renderer-1.4.jar
[INFO] Downloaded from central: https://repo.maven.apache.org/maven2/org/apache/maven/doxia/doxia-core/1.2/doxia-core-1.2.jar
(154 kB at 5.7 MB/s)
[INFO] Downloading from central: https://repo.maven.apache.org/maven2/org/apache/maven/doxia/doxia-decoration-model/1.4/doxia-decoration-model-1.4.jar
[INFO] Downloaded from central: https://repo.maven.apache.org/maven2/xml-apis/xml-apis/1.3.04/xml-apis-1.3.04.jar
(194 kB at 6.7 MB/s)
[INFO] Downloading from central: https://repo.maven.apache.org/maven2/org/apache/maven/doxia/doxia-module-xhtml/1.4/doxia-module-xhtml-1.4.jar
[INFO] Downloaded from central: https://repo.maven.apache.org/maven2/org/apache/maven/doxia/doxia-logging-api/1.4/doxia-logging-api-1.4.jar
(11 kB at 323 kB/s)
[INFO] Downloading from central: https://repo.maven.apache.org/maven2/org/apache/maven/doxia/doxia-module-fml/1.4/doxia-module-fml-1.4.jar
[INFO] Downloaded from central: https://repo.maven.apache.org/maven2/org/apache/maven/doxia/doxia-site-renderer/1.4/doxia-site-renderer-1.4.jar
(53 kB at 1.4 MB/s)
[INFO] Downloading from central: https://repo.maven.apache.org/maven2/org/codehaus/plexus/plexus-velocity/1.1.7/plexus-velocity-1.1.7.jar
[INFO] Downloaded from central: https://repo.maven.apache.org/maven2/org/apache/maven/doxia/doxia-module-xhtml/1.4/doxia-module-xhtml-1.4.jar
(15 kB at 395 kB/s)
[INFO] Downloading from central: https://repo.maven.apache.org/maven2/org/apache/velocity/velocity/1.5/velocity-1.5.jar
[INFO] Downloaded from central: https://repo.maven.apache.org/maven2/org/apache/maven/doxia/doxia-decoration-model/1.4/doxia-decoration-model-1.4.jar
(61 kB at 1.5 MB/s)
[INFO] Downloading from central: https://repo.maven.apache.org/maven2/org/apache/maven/shared/maven-dependency-analyzer/1.10/maven-dependency-analyzer-1.10.jar
[INFO] Downloaded from central: https://repo.maven.apache.org/maven2/org/codehaus/plexus/plexus-velocity/1.1.7/plexus-velocity-1.1.7.jar
(7.7 kB at 156 kB/s)
[INFO] Downloaded from central: https://repo.maven.apache.org/maven2/org/apache/maven/doxia/doxia-module-fml/1.4/doxia-module-fml-1.4.jar
(38 kB at 742 kB/s)
[INFO] Downloaded from central: https://repo.maven.apache.org/maven2/org/apache/maven/shared/maven-dependency-analyzer/1.10/maven-dependency-analyzer-1.10.jar
(35 kB at 504 kB/s)
[INFO] Downloaded from central: https://repo.maven.apache.org/maven2/xerces/xercesImpl/2.9.1/xercesImpl-2.9.1.jar
(1.2 MB at 16 MB/s)
[INFO] Downloaded from central: https://repo.maven.apache.org/maven2/org/apache/velocity/velocity/1.5/velocity-1.5.jar
(392 kB at 5.4 MB/s)
[INFO] Copying spotbugs-annotations-3.1.9.jar to <https://builds.apache.org/job/zookeeper-master-maven-owasp/ws/zookeeper-server/target/lib/spotbugs-annotations-3.1.9.jar>
[INFO] Copying jsr305-3.0.2.jar to <https://builds.apache.org/job/zookeeper-master-maven-owasp/ws/zookeeper-server/target/lib/jsr305-3.0.2.jar>
[INFO] Copying hamcrest-all-1.3.jar to <https://builds.apache.org/job/zookeeper-master-maven-owasp/ws/zookeeper-server/target/lib/hamcrest-all-1.3.jar>
[INFO] Copying commons-collections-3.2.2.jar to <https://builds.apache.org/job/zookeeper-master-maven-owasp/ws/zookeeper-server/target/lib/commons-collections-3.2.2.jar>
[INFO] Copying commons-lang-2.6.jar to <https://builds.apache.org/job/zookeeper-master-maven-owasp/ws/zookeeper-server/target/lib/commons-lang-2.6.jar>
[INFO] Copying zookeeper-jute-3.6.0-SNAPSHOT.jar to <https://builds.apache.org/job/zookeeper-master-maven-owasp/ws/zookeeper-server/target/lib/zookeeper-jute-3.6.0-SNAPSHOT.jar>
[INFO] Copying commons-cli-1.2.jar to <https://builds.apache.org/job/zookeeper-master-maven-owasp/ws/zookeeper-server/target/lib/commons-cli-1.2.jar>
[INFO] Copying audience-annotations-0.5.0.jar to <https://builds.apache.org/job/zookeeper-master-maven-owasp/ws/zookeeper-server/target/lib/audience-annotations-0.5.0.jar>
[INFO] Copying netty-all-4.1.36.Final.jar to <https://builds.apache.org/job/zookeeper-master-maven-owasp/ws/zookeeper-server/target/lib/netty-all-4.1.36.Final.jar>
[INFO] Copying slf4j-api-1.7.25.jar to <https://builds.apache.org/job/zookeeper-master-maven-owasp/ws/zookeeper-server/target/lib/slf4j-api-1.7.25.jar>
[INFO] Copying slf4j-log4j12-1.7.25.jar to <https://builds.apache.org/job/zookeeper-master-maven-owasp/ws/zookeeper-server/target/lib/slf4j-log4j12-1.7.25.jar>
[INFO] Copying jetty-server-9.4.17.v20190418.jar to <https://builds.apache.org/job/zookeeper-master-maven-owasp/ws/zookeeper-server/target/lib/jetty-server-9.4.17.v20190418.jar>
[INFO] Copying javax.servlet-api-3.1.0.jar to <https://builds.apache.org/job/zookeeper-master-maven-owasp/ws/zookeeper-server/target/lib/javax.servlet-api-3.1.0.jar>
[INFO] Copying jetty-http-9.4.17.v20190418.jar to <https://builds.apache.org/job/zookeeper-master-maven-owasp/ws/zookeeper-server/target/lib/jetty-http-9.4.17.v20190418.jar>
[INFO] Copying jetty-util-9.4.17.v20190418.jar to <https://builds.apache.org/job/zookeeper-master-maven-owasp/ws/zookeeper-server/target/lib/jetty-util-9.4.17.v20190418.jar>
[INFO] Copying jetty-io-9.4.17.v20190418.jar to <https://builds.apache.org/job/zookeeper-master-maven-owasp/ws/zookeeper-server/target/lib/jetty-io-9.4.17.v20190418.jar>
[INFO] Copying jetty-servlet-9.4.17.v20190418.jar to <https://builds.apache.org/job/zookeeper-master-maven-owasp/ws/zookeeper-server/target/lib/jetty-servlet-9.4.17.v20190418.jar>
[INFO] Copying jetty-security-9.4.17.v20190418.jar to <https://builds.apache.org/job/zookeeper-master-maven-owasp/ws/zookeeper-server/target/lib/jetty-security-9.4.17.v20190418.jar>
[INFO] Copying jackson-databind-2.9.9.jar to <https://builds.apache.org/job/zookeeper-master-maven-owasp/ws/zookeeper-server/target/lib/jackson-databind-2.9.9.jar>
[INFO] Copying jackson-annotations-2.9.0.jar to <https://builds.apache.org/job/zookeeper-master-maven-owasp/ws/zookeeper-server/target/lib/jackson-annotations-2.9.0.jar>
[INFO] Copying jackson-core-2.9.9.jar to <https://builds.apache.org/job/zookeeper-master-maven-owasp/ws/zookeeper-server/target/lib/jackson-core-2.9.9.jar>
[INFO] Copying json-simple-1.1.1.jar to <https://builds.apache.org/job/zookeeper-master-maven-owasp/ws/zookeeper-server/target/lib/json-simple-1.1.1.jar>
[INFO] Copying bcprov-jdk15on-1.60.jar to <https://builds.apache.org/job/zookeeper-master-maven-owasp/ws/zookeeper-server/target/lib/bcprov-jdk15on-1.60.jar>
[INFO] Copying bcpkix-jdk15on-1.60.jar to <https://builds.apache.org/job/zookeeper-master-maven-owasp/ws/zookeeper-server/target/lib/bcpkix-jdk15on-1.60.jar>
[INFO] Copying jline-2.11.jar to <https://builds.apache.org/job/zookeeper-master-maven-owasp/ws/zookeeper-server/target/lib/jline-2.11.jar>
[INFO] Copying metrics-core-3.2.5.jar to <https://builds.apache.org/job/zookeeper-master-maven-owasp/ws/zookeeper-server/target/lib/metrics-core-3.2.5.jar>
[INFO] Copying log4j-1.2.17.jar to <https://builds.apache.org/job/zookeeper-master-maven-owasp/ws/zookeeper-server/target/lib/log4j-1.2.17.jar>
[INFO] Copying kerb-core-1.1.0.jar to <https://builds.apache.org/job/zookeeper-master-maven-owasp/ws/zookeeper-server/target/lib/kerb-core-1.1.0.jar>
[INFO] Copying kerby-pkix-1.1.0.jar to <https://builds.apache.org/job/zookeeper-master-maven-owasp/ws/zookeeper-server/target/lib/kerby-pkix-1.1.0.jar>
[INFO] Copying kerby-asn1-1.1.0.jar to <https://builds.apache.org/job/zookeeper-master-maven-owasp/ws/zookeeper-server/target/lib/kerby-asn1-1.1.0.jar>
[INFO] Copying kerby-util-1.1.0.jar to <https://builds.apache.org/job/zookeeper-master-maven-owasp/ws/zookeeper-server/target/lib/kerby-util-1.1.0.jar>
[INFO] Copying kerb-simplekdc-1.1.0.jar to <https://builds.apache.org/job/zookeeper-master-maven-owasp/ws/zookeeper-server/target/lib/kerb-simplekdc-1.1.0.jar>
[INFO] Copying kerb-client-1.1.0.jar to <https://builds.apache.org/job/zookeeper-master-maven-owasp/ws/zookeeper-server/target/lib/kerb-client-1.1.0.jar>
[INFO] Copying kerb-common-1.1.0.jar to <https://builds.apache.org/job/zookeeper-master-maven-owasp/ws/zookeeper-server/target/lib/kerb-common-1.1.0.jar>
[INFO] Copying kerb-crypto-1.1.0.jar to <https://builds.apache.org/job/zookeeper-master-maven-owasp/ws/zookeeper-server/target/lib/kerb-crypto-1.1.0.jar>
[INFO] Copying commons-io-2.6.jar to <https://builds.apache.org/job/zookeeper-master-maven-owasp/ws/zookeeper-server/target/lib/commons-io-2.6.jar>
[INFO] Copying kerb-util-1.1.0.jar to <https://builds.apache.org/job/zookeeper-master-maven-owasp/ws/zookeeper-server/target/lib/kerb-util-1.1.0.jar>
[INFO] Copying token-provider-1.1.0.jar to <https://builds.apache.org/job/zookeeper-master-maven-owasp/ws/zookeeper-server/target/lib/token-provider-1.1.0.jar>
[INFO] Copying nimbus-jose-jwt-4.41.2.jar to <https://builds.apache.org/job/zookeeper-master-maven-owasp/ws/zookeeper-server/target/lib/nimbus-jose-jwt-4.41.2.jar>
[INFO] Copying jcip-annotations-1.0-1.jar to <https://builds.apache.org/job/zookeeper-master-maven-owasp/ws/zookeeper-server/target/lib/jcip-annotations-1.0-1.jar>
[INFO] Copying json-smart-2.3.jar to <https://builds.apache.org/job/zookeeper-master-maven-owasp/ws/zookeeper-server/target/lib/json-smart-2.3.jar>
[INFO] Copying accessors-smart-1.2.jar to <https://builds.apache.org/job/zookeeper-master-maven-owasp/ws/zookeeper-server/target/lib/accessors-smart-1.2.jar>
[INFO] Copying asm-5.0.4.jar to <https://builds.apache.org/job/zookeeper-master-maven-owasp/ws/zookeeper-server/target/lib/asm-5.0.4.jar>
[INFO] Copying kerb-admin-1.1.0.jar to <https://builds.apache.org/job/zookeeper-master-maven-owasp/ws/zookeeper-server/target/lib/kerb-admin-1.1.0.jar>
[INFO] Copying kerb-server-1.1.0.jar to <https://builds.apache.org/job/zookeeper-master-maven-owasp/ws/zookeeper-server/target/lib/kerb-server-1.1.0.jar>
[INFO] Copying kerb-identity-1.1.0.jar to <https://builds.apache.org/job/zookeeper-master-maven-owasp/ws/zookeeper-server/target/lib/kerb-identity-1.1.0.jar>
[INFO] Copying kerby-xdr-1.1.0.jar to <https://builds.apache.org/job/zookeeper-master-maven-owasp/ws/zookeeper-server/target/lib/kerby-xdr-1.1.0.jar>
[INFO] Copying kerby-config-1.1.0.jar to <https://builds.apache.org/job/zookeeper-master-maven-owasp/ws/zookeeper-server/target/lib/kerby-config-1.1.0.jar>
[INFO] Copying mockito-core-2.27.0.jar to <https://builds.apache.org/job/zookeeper-master-maven-owasp/ws/zookeeper-server/target/lib/mockito-core-2.27.0.jar>
[INFO] Copying byte-buddy-1.9.10.jar to <https://builds.apache.org/job/zookeeper-master-maven-owasp/ws/zookeeper-server/target/lib/byte-buddy-1.9.10.jar>
[INFO] Copying byte-buddy-agent-1.9.10.jar to <https://builds.apache.org/job/zookeeper-master-maven-owasp/ws/zookeeper-server/target/lib/byte-buddy-agent-1.9.10.jar>
[INFO] Copying objenesis-2.6.jar to <https://builds.apache.org/job/zookeeper-master-maven-owasp/ws/zookeeper-server/target/lib/objenesis-2.6.jar>
[INFO] Copying junit-4.12.jar to <https://builds.apache.org/job/zookeeper-master-maven-owasp/ws/zookeeper-server/target/lib/junit-4.12.jar>
[INFO] Copying hamcrest-core-1.3.jar to <https://builds.apache.org/job/zookeeper-master-maven-owasp/ws/zookeeper-server/target/lib/hamcrest-core-1.3.jar>
[INFO] Copying snappy-java-1.1.7.jar to <https://builds.apache.org/job/zookeeper-master-maven-owasp/ws/zookeeper-server/target/lib/snappy-java-1.1.7.jar>
[INFO] 
[INFO] --- dependency-check-maven:4.0.2:check (default-cli) @ zookeeper ---
[INFO] Central analyzer disabled
[INFO] Checking for updates
[INFO] Skipping NVD check since last check was within 4 hours.
[INFO] Skipping RetireJS update since last update was within 24 hours.
[INFO] Check for updates complete (10 ms)
[INFO] Analysis Started
[INFO] Finished Archive Analyzer (0 seconds)
[INFO] Finished File Name Analyzer (0 seconds)
[INFO] Finished Jar Analyzer (0 seconds)
[INFO] Finished Assembly Analyzer (0 seconds)
[INFO] Finished Dependency Merging Analyzer (0 seconds)
[INFO] Finished Version Filter Analyzer (0 seconds)
[INFO] Finished Hint Analyzer (0 seconds)
[INFO] Created CPE Index (0 seconds)
[INFO] Skipping CPE Analysis for npm
[INFO] Finished CPE Analyzer (1 seconds)
[INFO] Finished False Positive Analyzer (0 seconds)
[INFO] Finished NVD CVE Analyzer (0 seconds)
[INFO] Finished Vulnerability Suppression Analyzer (0 seconds)
[INFO] Finished Dependency Bundling Analyzer (0 seconds)
[INFO] Analysis Complete (2 seconds)
[WARNING] 

One or more dependencies were identified with known vulnerabilities in Apache ZooKeeper -
Server:

jackson-databind-2.9.9.jar (cpe:/a:fasterxml:jackson:2.9.9, cpe:/a:fasterxml:jackson-databind:2.9.9,
com.fasterxml.jackson.core:jackson-databind:2.9.9) : CVE-2019-12814


See the dependency-check report for more details.


[INFO] ------------------------------------------------------------------------
[INFO] Reactor Summary for Apache ZooKeeper 3.6.0-SNAPSHOT:
[INFO] 
[INFO] Apache ZooKeeper ................................... SUCCESS [04:00 min]
[INFO] Apache ZooKeeper - Documentation ................... SUCCESS [ 10.521 s]
[INFO] Apache ZooKeeper - Jute ............................ SUCCESS [ 16.925 s]
[INFO] Apache ZooKeeper - Server .......................... FAILURE [ 30.973 s]
[INFO] Apache ZooKeeper - Metrics Providers ............... SKIPPED
[INFO] Apache ZooKeeper - Prometheus.io Metrics Provider .. SKIPPED
[INFO] Apache ZooKeeper - Client .......................... SKIPPED
[INFO] Apache ZooKeeper - Recipes ......................... SKIPPED
[INFO] Apache ZooKeeper - Recipes - Election .............. SKIPPED
[INFO] Apache ZooKeeper - Recipes - Lock .................. SKIPPED
[INFO] Apache ZooKeeper - Recipes - Queue ................. SKIPPED
[INFO] Apache ZooKeeper - Assembly ........................ SKIPPED
[INFO] ------------------------------------------------------------------------
[INFO] BUILD FAILURE
[INFO] ------------------------------------------------------------------------
[INFO] Total time:  05:31 min
[INFO] Finished at: 2019-07-02T23:31:30Z
[INFO] ------------------------------------------------------------------------
Waiting for Jenkins to finish collecting data
[ERROR] Failed to execute goal org.owasp:dependency-check-maven:4.0.2:check (default-cli)
on project zookeeper:
[ERROR] 
[ERROR] One or more dependencies were identified with vulnerabilities that have a CVSS score
greater than or equal to '0.0':
[ERROR] 
[ERROR] jackson-databind-2.9.9.jar: CVE-2019-12814
[ERROR] 
[ERROR] See the dependency-check report for more details.
[ERROR] -> [Help 1]
[ERROR] 
[ERROR] To see the full stack trace of the errors, re-run Maven with the -e switch.
[ERROR] Re-run Maven using the -X switch to enable full debug logging.
[ERROR] 
[ERROR] For more information about the errors and possible solutions, please read the following
articles:
[ERROR] [Help 1] http://cwiki.apache.org/confluence/display/MAVEN/MojoFailureException
[ERROR] 
[ERROR] After correcting the problems, you can resume the build with the command
[ERROR]   mvn <goals> -rf :zookeeper
[JENKINS] Archiving <https://builds.apache.org/job/zookeeper-master-maven-owasp/ws/zookeeper-server/pom.xml>
to org.apache.zookeeper/zookeeper/3.6.0-SNAPSHOT/zookeeper-3.6.0-SNAPSHOT.pom
[JENKINS] Archiving <https://builds.apache.org/job/zookeeper-master-maven-owasp/ws/zookeeper-server/target/zookeeper-3.6.0-SNAPSHOT.jar>
to org.apache.zookeeper/zookeeper/3.6.0-SNAPSHOT/zookeeper-3.6.0-SNAPSHOT.jar
[JENKINS] Archiving <https://builds.apache.org/job/zookeeper-master-maven-owasp/ws/zookeeper-server/target/zookeeper-3.6.0-SNAPSHOT-tests.jar>
to org.apache.zookeeper/zookeeper/3.6.0-SNAPSHOT/zookeeper-3.6.0-SNAPSHOT-tests.jar
[JENKINS] Archiving <https://builds.apache.org/job/zookeeper-master-maven-owasp/ws/zookeeper-server/target/zookeeper-3.6.0-SNAPSHOT-sources.jar>
to org.apache.zookeeper/zookeeper/3.6.0-SNAPSHOT/zookeeper-3.6.0-SNAPSHOT-sources.jar
[JENKINS] Archiving <https://builds.apache.org/job/zookeeper-master-maven-owasp/ws/zookeeper-server/target/zookeeper-3.6.0-SNAPSHOT-javadoc.jar>
to org.apache.zookeeper/zookeeper/3.6.0-SNAPSHOT/zookeeper-3.6.0-SNAPSHOT-javadoc.jar
[Fast Archiver] No prior successful build to compare, so performing full copy of artifacts
[JENKINS] Archiving <https://builds.apache.org/job/zookeeper-master-maven-owasp/ws/zookeeper-client/pom.xml>
to org.apache.zookeeper/zookeeper-client/3.6.0-SNAPSHOT/zookeeper-client-3.6.0-SNAPSHOT.pom
[Fast Archiver] No prior successful build to compare, so performing full copy of artifacts
[JENKINS] Archiving <https://builds.apache.org/job/zookeeper-master-maven-owasp/ws/zookeeper-jute/pom.xml>
to org.apache.zookeeper/zookeeper-jute/3.6.0-SNAPSHOT/zookeeper-jute-3.6.0-SNAPSHOT.pom
[JENKINS] Archiving <https://builds.apache.org/job/zookeeper-master-maven-owasp/ws/zookeeper-jute/target/zookeeper-jute-3.6.0-SNAPSHOT.jar>
to org.apache.zookeeper/zookeeper-jute/3.6.0-SNAPSHOT/zookeeper-jute-3.6.0-SNAPSHOT.jar
[JENKINS] Archiving <https://builds.apache.org/job/zookeeper-master-maven-owasp/ws/zookeeper-jute/target/zookeeper-jute-3.6.0-SNAPSHOT-tests.jar>
to org.apache.zookeeper/zookeeper-jute/3.6.0-SNAPSHOT/zookeeper-jute-3.6.0-SNAPSHOT-tests.jar
[JENKINS] Archiving <https://builds.apache.org/job/zookeeper-master-maven-owasp/ws/zookeeper-jute/target/zookeeper-jute-3.6.0-SNAPSHOT-sources.jar>
to org.apache.zookeeper/zookeeper-jute/3.6.0-SNAPSHOT/zookeeper-jute-3.6.0-SNAPSHOT-sources.jar
[JENKINS] Archiving <https://builds.apache.org/job/zookeeper-master-maven-owasp/ws/zookeeper-jute/target/zookeeper-jute-3.6.0-SNAPSHOT-javadoc.jar>
to org.apache.zookeeper/zookeeper-jute/3.6.0-SNAPSHOT/zookeeper-jute-3.6.0-SNAPSHOT-javadoc.jar
[JENKINS] Archiving <https://builds.apache.org/job/zookeeper-master-maven-owasp/ws/zookeeper-metrics-providers/pom.xml>
to org.apache.zookeeper/zookeeper-metrics-providers/3.6.0-SNAPSHOT/zookeeper-metrics-providers-3.6.0-SNAPSHOT.pom
[Fast Archiver] No prior successful build to compare, so performing full copy of artifacts
[JENKINS] Archiving <https://builds.apache.org/job/zookeeper-master-maven-owasp/ws/zookeeper-metrics-providers/zookeeper-prometheus-metrics/pom.xml>
to org.apache.zookeeper/zookeeper-prometheus-metrics/3.6.0-SNAPSHOT/zookeeper-prometheus-metrics-3.6.0-SNAPSHOT.pom
[Fast Archiver] No prior successful build to compare, so performing full copy of artifacts
[JENKINS] Archiving <https://builds.apache.org/job/zookeeper-master-maven-owasp/ws/zookeeper-recipes/zookeeper-recipes-election/pom.xml>
to org.apache.zookeeper/zookeeper-recipes-election/3.6.0-SNAPSHOT/zookeeper-recipes-election-3.6.0-SNAPSHOT.pom
[Fast Archiver] No prior successful build to compare, so performing full copy of artifacts
[JENKINS] Archiving <https://builds.apache.org/job/zookeeper-master-maven-owasp/ws/zookeeper-recipes/zookeeper-recipes-queue/pom.xml>
to org.apache.zookeeper/zookeeper-recipes-queue/3.6.0-SNAPSHOT/zookeeper-recipes-queue-3.6.0-SNAPSHOT.pom
[Fast Archiver] No prior successful build to compare, so performing full copy of artifacts
[JENKINS] Archiving <https://builds.apache.org/job/zookeeper-master-maven-owasp/ws/zookeeper-docs/pom.xml>
to org.apache.zookeeper/zookeeper-docs/3.6.0-SNAPSHOT/zookeeper-docs-3.6.0-SNAPSHOT.pom
[JENKINS] Archiving <https://builds.apache.org/job/zookeeper-master-maven-owasp/ws/zookeeper-docs/target/zookeeper-docs-3.6.0-SNAPSHOT.jar>
to org.apache.zookeeper/zookeeper-docs/3.6.0-SNAPSHOT/zookeeper-docs-3.6.0-SNAPSHOT.jar
[JENKINS] Archiving <https://builds.apache.org/job/zookeeper-master-maven-owasp/ws/zookeeper-docs/target/zookeeper-docs-3.6.0-SNAPSHOT-tests.jar>
to org.apache.zookeeper/zookeeper-docs/3.6.0-SNAPSHOT/zookeeper-docs-3.6.0-SNAPSHOT-tests.jar
[JENKINS] Archiving <https://builds.apache.org/job/zookeeper-master-maven-owasp/ws/zookeeper-docs/target/zookeeper-docs-3.6.0-SNAPSHOT-sources.jar>
to org.apache.zookeeper/zookeeper-docs/3.6.0-SNAPSHOT/zookeeper-docs-3.6.0-SNAPSHOT-sources.jar
[JENKINS] Archiving <https://builds.apache.org/job/zookeeper-master-maven-owasp/ws/zookeeper-recipes/pom.xml>
to org.apache.zookeeper/zookeeper-recipes/3.6.0-SNAPSHOT/zookeeper-recipes-3.6.0-SNAPSHOT.pom
[Fast Archiver] No prior successful build to compare, so performing full copy of artifacts
[JENKINS] Archiving <https://builds.apache.org/job/zookeeper-master-maven-owasp/ws/pom.xml>
to org.apache.zookeeper/parent/3.6.0-SNAPSHOT/parent-3.6.0-SNAPSHOT.pom
[JENKINS] Archiving <https://builds.apache.org/job/zookeeper-master-maven-owasp/ws/zookeeper-recipes/zookeeper-recipes-lock/pom.xml>
to org.apache.zookeeper/zookeeper-recipes-lock/3.6.0-SNAPSHOT/zookeeper-recipes-lock-3.6.0-SNAPSHOT.pom
[Fast Archiver] No prior successful build to compare, so performing full copy of artifacts
[JENKINS] Archiving <https://builds.apache.org/job/zookeeper-master-maven-owasp/ws/zookeeper-assembly/pom.xml>
to org.apache.zookeeper/zookeeper-assembly/3.6.0-SNAPSHOT/zookeeper-assembly-3.6.0-SNAPSHOT.pom
[Fast Archiver] No prior successful build to compare, so performing full copy of artifacts
channel stopped
[SpotBugs] Skipping execution of recorder since overall result is 'FAILURE'

Mime
View raw message