zookeeper-dev mailing list archives

Site index · List index
Message view « Date » · « Thread »
Top « Date » · « Thread »
From Apache Jenkins Server <jenk...@builds.apache.org>
Subject Build failed in Jenkins: zookeeper-master-maven-jdk11 #64
Date Mon, 29 Jul 2019 11:17:23 GMT
See <https://builds.apache.org/job/zookeeper-master-maven-jdk11/64/display/redirect?page=changes>

Changes:

[nkalmar] ZOOKEEPER-3320: Leader election port stop listen when hostname

------------------------------------------
[...truncated 502.51 KB...]
     [exec]  : elapsed 8322 : OK
     [exec] ZooKeeper JMX enabled by default
     [exec] Using config: <https://builds.apache.org/job/zookeeper-master-maven-jdk11/ws/zookeeper-client/zookeeper-client-c/../../build/test/test-cppunit/conf/1.conf>
     [exec] TestReconfigServer::testReconfigFailureWithoutServerSuperuserPasswordConfiguredStarting
zookeeper ... STARTED
     [exec] ZooKeeper JMX enabled by default
     [exec] Using config: <https://builds.apache.org/job/zookeeper-master-maven-jdk11/ws/zookeeper-client/zookeeper-client-c/../../build/test/test-cppunit/conf/2.conf>
     [exec] Starting zookeeper ... STARTED
     [exec] ZooKeeper JMX enabled by default
     [exec] Using config: <https://builds.apache.org/job/zookeeper-master-maven-jdk11/ws/zookeeper-client/zookeeper-client-c/../../build/test/test-cppunit/conf/0.conf>
     [exec] Starting zookeeper ... STARTED
     [exec] ZooKeeper JMX enabled by default
     [exec] Using config: <https://builds.apache.org/job/zookeeper-master-maven-jdk11/ws/zookeeper-client/zookeeper-client-c/../../build/test/test-cppunit/conf/1.conf>
     [exec] ZooKeeper JMX enabled by default
     [exec] Using config: <https://builds.apache.org/job/zookeeper-master-maven-jdk11/ws/zookeeper-client/zookeeper-client-c/../../build/test/test-cppunit/conf/2.conf>
     [exec] ZooKeeper JMX enabled by default
     [exec] Using config: <https://builds.apache.org/job/zookeeper-master-maven-jdk11/ws/zookeeper-client/zookeeper-client-c/../../build/test/test-cppunit/conf/0.conf>
     [exec] ZooKeeper JMX enabled by default
     [exec] Using config: <https://builds.apache.org/job/zookeeper-master-maven-jdk11/ws/zookeeper-client/zookeeper-client-c/../../build/test/test-cppunit/conf/1.conf>
     [exec] ZooKeeper JMX enabled by default
     [exec] Using config: <https://builds.apache.org/job/zookeeper-master-maven-jdk11/ws/zookeeper-client/zookeeper-client-c/../../build/test/test-cppunit/conf/2.conf>
     [exec] ZooKeeper JMX enabled by default
     [exec] Stopping zookeeper ... STOPPED
     [exec] Stopping zookeeper ... STOPPED
     [exec] Stopping zookeeper ... STOPPED
     [exec] Using config: <https://builds.apache.org/job/zookeeper-master-maven-jdk11/ws/zookeeper-client/zookeeper-client-c/../../build/test/test-cppunit/conf/0.conf>
     [exec] ZooKeeper JMX enabled by default
     [exec] Using config: <https://builds.apache.org/job/zookeeper-master-maven-jdk11/ws/zookeeper-client/zookeeper-client-c/../../build/test/test-cppunit/conf/1.conf>
     [exec] Starting zookeeper ... STARTED
     [exec] Starting zookeeper ... STARTED
     [exec] ZooKeeper JMX enabled by default
     [exec] Using config: <https://builds.apache.org/job/zookeeper-master-maven-jdk11/ws/zookeeper-client/zookeeper-client-c/../../build/test/test-cppunit/conf/2.conf>
     [exec] ZooKeeper JMX enabled by default
     [exec] Using config: <https://builds.apache.org/job/zookeeper-master-maven-jdk11/ws/zookeeper-client/zookeeper-client-c/../../build/test/test-cppunit/conf/0.conf>
     [exec] Starting zookeeper ... STARTED
     [exec] ZooKeeper JMX enabled by default
     [exec] Using config: <https://builds.apache.org/job/zookeeper-master-maven-jdk11/ws/zookeeper-client/zookeeper-client-c/../../build/test/test-cppunit/conf/1.conf>
     [exec] ZooKeeper JMX enabled by default
     [exec] Using config: <https://builds.apache.org/job/zookeeper-master-maven-jdk11/ws/zookeeper-client/zookeeper-client-c/../../build/test/test-cppunit/conf/2.conf>
     [exec] ZooKeeper JMX enabled by default
     [exec] Using config: <https://builds.apache.org/job/zookeeper-master-maven-jdk11/ws/zookeeper-client/zookeeper-client-c/../../build/test/test-cppunit/conf/0.conf>
     [exec] ZooKeeper JMX enabled by default
     [exec] Using config: <https://builds.apache.org/job/zookeeper-master-maven-jdk11/ws/zookeeper-client/zookeeper-client-c/../../build/test/test-cppunit/conf/1.conf>
     [exec] ZooKeeper JMX enabled by default
     [exec] Using config: <https://builds.apache.org/job/zookeeper-master-maven-jdk11/ws/zookeeper-client/zookeeper-client-c/../../build/test/test-cppunit/conf/2.conf>
     [exec] ZooKeeper JMX enabled by default
     [exec] Using config: <https://builds.apache.org/job/zookeeper-master-maven-jdk11/ws/zookeeper-client/zookeeper-client-c/../../build/test/test-cppunit/conf/0.conf>
     [exec] ZooKeeper JMX enabled by default
     [exec] Using config: <https://builds.apache.org/job/zookeeper-master-maven-jdk11/ws/zookeeper-client/zookeeper-client-c/../../build/test/test-cppunit/conf/1.conf>
     [exec] ZooKeeper JMX enabled by default
     [exec] Using config: <https://builds.apache.org/job/zookeeper-master-maven-jdk11/ws/zookeeper-client/zookeeper-client-c/../../build/test/test-cppunit/conf/0.conf>
     [exec] ZooKeeper JMX enabled by default
     [exec] Using config: <https://builds.apache.org/job/zookeeper-master-maven-jdk11/ws/zookeeper-client/zookeeper-client-c/../../build/test/test-cppunit/conf/1.conf>
     [exec] ZooKeeper JMX enabled by default
     [exec] Using config: <https://builds.apache.org/job/zookeeper-master-maven-jdk11/ws/zookeeper-client/zookeeper-client-c/../../build/test/test-cppunit/conf/2.conf>
     [exec] Stopping zookeeper ... STOPPED
     [exec] Stopping zookeeper ... STOPPED
     [exec] Stopping zookeeper ... STOPPED
     [exec]  : elapsed 13121 : OK
     [exec] Zookeeper_clientretry::testRetry ZooKeeper server started ZooKeeper server process
failed ZooKeeper server NOT started : elapsed 9395 : OK
     [exec] Zookeeper_operations::testAsyncWatcher1 : elapsed 5 : OK
     [exec] Zookeeper_operations::testAsyncGetOperation : elapsed 5 : OK
     [exec] Zookeeper_operations::testOperationsAndDisconnectConcurrently1 : elapsed 365 :
OK
     [exec] Zookeeper_operations::testOperationsAndDisconnectConcurrently2 : elapsed 0 : OK
     [exec] Zookeeper_operations::testConcurrentOperations1 : elapsed 22514 : OK
     [exec] Zookeeper_multi::testCreate : assertion : elapsed 10001
     [exec] Zookeeper_multi::testCreateDelete : assertion : elapsed 10001
     [exec] Zookeeper_multi::testInvalidVersion : assertion : elapsed 10001
     [exec] Zookeeper_multi::testNestedCreate : assertion : elapsed 10002
     [exec] Zookeeper_multi::testSetData : assertion : elapsed 10002
     [exec] Zookeeper_multi::testUpdateConflict : assertion : elapsed 10001
     [exec] Zookeeper_multi::testDeleteUpdateConflict : assertion : elapsed 10001
     [exec] Zookeeper_multi::testAsyncMulti : assertion : elapsed 10001
     [exec] Zookeeper_multi::testMultiFail : assertion : elapsed 10001
     [exec] Zookeeper_multi::testCheck : assertion : elapsed 10001
     [exec] Zookeeper_multi::testWatch : assertion : elapsed 10001
     [exec] Zookeeper_multi::testSequentialNodeCreateInAsyncMulti : assertion : elapsed 10001
     [exec] Zookeeper_multi::testBigAsyncMulti : assertion : elapsed 10001
     [exec] Zookeeper_watchers::testDefaultSessionWatcher1 : elapsed 52 : OK
     [exec] Zookeeper_watchers::testDefaultSessionWatcher2 : elapsed 4 : OK
     [exec] Zookeeper_watchers::testObjectSessionWatcher1 : elapsed 55 : OK
     [exec] Zookeeper_watchers::testObjectSessionWatcher2 : elapsed 57 : OK
     [exec] Zookeeper_watchers::testNodeWatcher1 : elapsed 57 : OK
     [exec] Zookeeper_watchers::testChildWatcher1 : elapsed 56 : OK
     [exec] Zookeeper_watchers::testChildWatcher2 : elapsed 56 : OK
     [exec] Zookeeper_simpleSystem::testLogCallbackSetLog Message Received: [2019-07-29 11:16:28,097:5743(0x7f285703b740):ZOO_INFO@testLogCallbackSet@1010:
testLogCallbackSet #0]
     [exec] Log Message Received: [2019-07-29 11:16:28,097:5743(0x7f285703b740):ZOO_INFO@testLogCallbackSet@1010:
testLogCallbackSet #1]
     [exec] Log Message Received: [2019-07-29 11:16:28,097:5743(0x7f285703b740):ZOO_INFO@testLogCallbackSet@1010:
testLogCallbackSet #2]
     [exec] Log Message Received: [2019-07-29 11:16:28,097:5743(0x7f285703b740):ZOO_INFO@testLogCallbackSet@1010:
testLogCallbackSet #3]
     [exec] Log Message Received: [2019-07-29 11:16:28,097:5743(0x7f285703b740):ZOO_INFO@testLogCallbackSet@1010:
testLogCallbackSet #4]
     [exec] Log Message Received: [2019-07-29 11:16:28,097:5743(0x7f285703b740):ZOO_INFO@testLogCallbackSet@1010:
testLogCallbackSet #5]
     [exec] Log Message Received: [2019-07-29 11:16:28,097:5743(0x7f285703b740):ZOO_INFO@testLogCallbackSet@1010:
testLogCallbackSet #6]
     [exec] Log Message Received: [2019-07-29 11:16:28,097:5743(0x7f285703b740):ZOO_INFO@testLogCallbackSet@1010:
testLogCallbackSet #7]
     [exec] Log Message Received: [2019-07-29 11:16:28,097:5743(0x7f285703b740):ZOO_INFO@testLogCallbackSet@1010:
testLogCallbackSet #8]
     [exec] Log Message Received: [2019-07-29 11:16:28,097:5743(0x7f285703b740):ZOO_INFO@testLogCallbackSet@1010:
testLogCallbackSet #9]
     [exec] Log Message Received: [2019-07-29 11:16:28,097:5743(0x7f285703b740):ZOO_INFO@zookeeper_close@3275:
Freeing zookeeper resources for sessionId=0
     [exec] ]
     [exec]  : elapsed 1001 : OK
     [exec] Zookeeper_simpleSystem::testLogCallbackInitLog Message Received: [2019-07-29 11:16:28,097:5743(0x7f285703b740):ZOO_INFO@log_env@1101:
Client environment:zookeeper.version=zookeeper C client 3.6.0]
     [exec] Log Message Received: [2019-07-29 11:16:28,097:5743(0x7f285703b740):ZOO_INFO@log_env@1105:
Client environment:host.name=asf917.gq1.ygridcore.net]
     [exec] Log Message Received: [2019-07-29 11:16:28,097:5743(0x7f285703b740):ZOO_INFO@log_env@1112:
Client environment:os.name=Linux]
     [exec] Log Message Received: [2019-07-29 11:16:28,097:5743(0x7f285703b740):ZOO_INFO@log_env@1113:
Client environment:os.arch=4.4.0-138-generic]
     [exec] Log Message Received: [2019-07-29 11:16:28,097:5743(0x7f285703b740):ZOO_INFO@log_env@1114:
Client environment:os.version=#164-Ubuntu SMP Tue Oct 2 17:16:02 UTC 2018]
     [exec] Log Message Received: [2019-07-29 11:16:28,098:5743(0x7f285703b740):ZOO_INFO@log_env@1122:
Client environment:user.name=jenkins]
     [exec] Log Message Received: [2019-07-29 11:16:28,098:5743(0x7f285703b740):ZOO_INFO@log_env@1130:
Client environment:user.home=/home/jenkins]
     [exec] Log Message Received: [2019-07-29 11:16:28,098:5743(0x7f285703b740):ZOO_INFO@log_env@1142:
Client environment:user.dir=<https://builds.apache.org/job/zookeeper-master-maven-jdk11/ws/zookeeper-client/zookeeper-client-c/target/c]>
     [exec] Log Message Received: [2019-07-29 11:16:28,098:5743(0x7f285703b740):ZOO_INFO@zookeeper_init_internal@1188:
Initiating client connection, host=127.0.0.1:22181 sessionTimeout=10000 watcher=0x45d060 sessionId=0
sessionPasswd=<null> context=0x7ffd04bd4640 flags=0]
     [exec] Log Message Received: [2019-07-29 11:16:28,098:5743(0x7f284ffff700):ZOO_ERROR@handle_socket_error_msg@2468:
Socket 127.0.0.1:22181 zk retcode=-4, errno=111(Connection refused): server refused to accept
the client]
     [exec] Log Message Received: [2019-07-29 11:16:28,098:5743(0x7f284ffff700):ZOO_ERROR@handle_socket_error_msg@2468:
Socket 127.0.0.1:22181 zk retcode=-4, errno=111(Connection refused): server refused to accept
the client]
     [exec] Log Message Received: [2019-07-29 11:16:28,098:5743(0x7f284ffff700):ZOO_WARN@zookeeper_interest@2316:
Delaying connection after exhaustively trying all servers [127.0.0.1:22181]]
     [exec] Log Message Received: [2019-07-29 11:16:28,265:5743(0x7f284ffff700):ZOO_ERROR@handle_socket_error_msg@2468:
Socket 127.0.0.1:22181 zk retcode=-4, errno=111(Connection refused): server refused to accept
the client]
     [exec] Log Message Received: [2019-07-29 11:16:28,265:5743(0x7f284ffff700):ZOO_WARN@zookeeper_interest@2316:
Delaying connection after exhaustively trying all servers [127.0.0.1:22181]]
     [exec] Log Message Received: [2019-07-29 11:16:28,431:5743(0x7f284ffff700):ZOO_ERROR@handle_socket_error_msg@2468:
Socket 127.0.0.1:22181 zk retcode=-4, errno=111(Connection refused): server refused to accept
the client]
     [exec] Log Message Received: [2019-07-29 11:16:28,432:5743(0x7f284ffff700):ZOO_WARN@zookeeper_interest@2316:
Delaying connection after exhaustively trying all servers [127.0.0.1:22181]]
     [exec] Log Message Received: [2019-07-29 11:16:28,598:5743(0x7f284ffff700):ZOO_ERROR@handle_socket_error_msg@2468:
Socket 127.0.0.1:22181 zk retcode=-4, errno=111(Connection refused): server refused to accept
the client]
     [exec] Log Message Received: [2019-07-29 11:16:28,598:5743(0x7f284ffff700):ZOO_WARN@zookeeper_interest@2316:
Delaying connection after exhaustively trying all servers [127.0.0.1:22181]]
     [exec] Log Message Received: [2019-07-29 11:16:28,764:5743(0x7f284ffff700):ZOO_ERROR@handle_socket_error_msg@2468:
Socket 127.0.0.1:22181 zk retcode=-4, errno=111(Connection refused): server refused to accept
the client]
     [exec] Log Message Received: [2019-07-29 11:16:28,765:5743(0x7f284ffff700):ZOO_WARN@zookeeper_interest@2316:
Delaying connection after exhaustively trying all servers [127.0.0.1:22181]]
     [exec] Log Message Received: [2019-07-29 11:16:28,931:5743(0x7f284ffff700):ZOO_ERROR@handle_socket_error_msg@2468:
Socket 127.0.0.1:22181 zk retcode=-4, errno=111(Connection refused): server refused to accept
the client]
     [exec] Log Message Received: [2019-07-29 11:16:28,931:5743(0x7f284ffff700):ZOO_WARN@zookeeper_interest@2316:
Delaying connection after exhaustively trying all servers [127.0.0.1:22181]]
     [exec] Log Message Received: [2019-07-29 11:16:29,098:5743(0x7f284ffff700):ZOO_ERROR@handle_socket_error_msg@2468:
Socket 127.0.0.1:22181 zk retcode=-4, errno=111(Connection refused): server refused to accept
the client]
     [exec] Log Message Received: [2019-07-29 11:16:29,098:5743(0x7f284ffff700):ZOO_WARN@zookeeper_interest@2316:
Delaying connection after exhaustively trying all servers [127.0.0.1:22181]]
     [exec] Log Message Received: [2019-07-29 11:16:29,098:5743(0x7f285703b740):ZOO_INFO@testLogCallbackInit@1032:
testLogCallbackInit #0]
     [exec] Log Message Received: [2019-07-29 11:16:29,098:5743(0x7f285703b740):ZOO_INFO@testLogCallbackInit@1032:
testLogCallbackInit #1]
     [exec] Log Message Received: [2019-07-29 11:16:29,098:5743(0x7f285703b740):ZOO_INFO@testLogCallbackInit@1032:
testLogCallbackInit #2]
     [exec] Log Message Received: [2019-07-29 11:16:29,098:5743(0x7f285703b740):ZOO_INFO@testLogCallbackInit@1032:
testLogCallbackInit #3]
     [exec] Log Message Received: [2019-07-29 11:16:29,098:5743(0x7f285703b740):ZOO_INFO@testLogCallbackInit@1032:
testLogCallbackInit #4]
     [exec] Log Message Received: [2019-07-29 11:16:29,098:5743(0x7f285703b740):ZOO_INFO@testLogCallbackInit@1032:
testLogCallbackInit #5]
     [exec] Log Message Received: [2019-07-29 11:16:29,098:5743(0x7f285703b740):ZOO_INFO@testLogCallbackInit@1032:
testLogCallbackInit #6]
     [exec] Log Message Received: [2019-07-29 11:16:29,098:5743(0x7f285703b740):ZOO_INFO@testLogCallbackInit@1032:
testLogCallbackInit #7]
     [exec] Log Message Received: [2019-07-29 11:16:29,098:5743(0x7f285703b740):ZOO_INFO@testLogCallbackInit@1032:
testLogCallbackInit #8]
     [exec] Log Message Received: [2019-07-29 11:16:29,098:5743(0x7f285703b740):ZOO_INFO@testLogCallbackInit@1032:
testLogCallbackInit #9]
     [exec] Log Message Received: [2019-07-29 11:16:29,098:5743(0x7f285703b740):ZOO_INFO@zookeeper_close@3275:
Freeing zookeeper resources for sessionId=0
     [exec] ]
     [exec]  : elapsed 1001 : OK
     [exec] Zookeeper_simpleSystem::testLogCallbackClearLog Message Received: [2019-07-29
11:16:29,098:5743(0x7f285703b740):ZOO_INFO@log_env@1101: Client environment:zookeeper.version=zookeeper
C client 3.6.0]
     [exec] Log Message Received: [2019-07-29 11:16:29,098:5743(0x7f285703b740):ZOO_INFO@log_env@1105:
Client environment:host.name=asf917.gq1.ygridcore.net]
     [exec] Log Message Received: [2019-07-29 11:16:29,098:5743(0x7f285703b740):ZOO_INFO@log_env@1112:
Client environment:os.name=Linux]
     [exec] Log Message Received: [2019-07-29 11:16:29,098:5743(0x7f285703b740):ZOO_INFO@log_env@1113:
Client environment:os.arch=4.4.0-138-generic]
     [exec] Log Message Received: [2019-07-29 11:16:29,099:5743(0x7f285703b740):ZOO_INFO@log_env@1114:
Client environment:os.version=#164-Ubuntu SMP Tue Oct 2 17:16:02 UTC 2018]
     [exec] Log Message Received: [2019-07-29 11:16:29,099:5743(0x7f285703b740):ZOO_INFO@log_env@1122:
Client environment:user.name=jenkins]
     [exec] Log Message Received: [2019-07-29 11:16:29,099:5743(0x7f285703b740):ZOO_INFO@log_env@1130:
Client environment:user.home=/home/jenkins]
     [exec] Log Message Received: [2019-07-29 11:16:29,099:5743(0x7f285703b740):ZOO_INFO@log_env@1142:
Client environment:user.dir=<https://builds.apache.org/job/zookeeper-master-maven-jdk11/ws/zookeeper-client/zookeeper-client-c/target/c]>
     [exec] Log Message Received: [2019-07-29 11:16:29,099:5743(0x7f285703b740):ZOO_INFO@zookeeper_init_internal@1188:
Initiating client connection, host=127.0.0.1:22181 sessionTimeout=10000 watcher=0x45d060 sessionId=0
sessionPasswd=<null> context=0x7ffd04bd46e0 flags=0]
     [exec] Log Message Received: [2019-07-29 11:16:29,099:5743(0x7f284f7fe700):ZOO_ERROR@handle_socket_error_msg@2468:
Socket 127.0.0.1:22181 zk retcode=-4, errno=111(Connection refused): server refused to accept
the client]
     [exec] Log Message Received: [2019-07-29 11:16:29,099:5743(0x7f284f7fe700):ZOO_ERROR@handle_socket_error_msg@2468:
Socket 127.0.0.1:22181 zk retcode=-4, errno=111(Connection refused): server refused to accept
the client]
     [exec] Log Message Received: [2019-07-29 11:16:29,099:5743(0x7f284f7fe700):ZOO_WARN@zookeeper_interest@2316:
Delaying connection after exhaustively trying all servers [127.0.0.1:22181]]
     [exec] Log Message Received: [2019-07-29 11:16:29,266:5743(0x7f284f7fe700):ZOO_ERROR@handle_socket_error_msg@2468:
Socket 127.0.0.1:22181 zk retcode=-4, errno=111(Connection refused): server refused to accept
the client]
     [exec] Log Message Received: [2019-07-29 11:16:29,266:5743(0x7f284f7fe700):ZOO_WARN@zookeeper_interest@2316:
Delaying connection after exhaustively trying all servers [127.0.0.1:22181]]
     [exec] Log Message Received: [2019-07-29 11:16:29,432:5743(0x7f284f7fe700):ZOO_ERROR@handle_socket_error_msg@2468:
Socket 127.0.0.1:22181 zk retcode=-4, errno=111(Connection refused): server refused to accept
the client]
     [exec] Log Message Received: [2019-07-29 11:16:29,433:5743(0x7f284f7fe700):ZOO_WARN@zookeeper_interest@2316:
Delaying connection after exhaustively trying all servers [127.0.0.1:22181]]
     [exec] Log Message Received: [2019-07-29 11:16:29,599:5743(0x7f284f7fe700):ZOO_ERROR@handle_socket_error_msg@2468:
Socket 127.0.0.1:22181 zk retcode=-4, errno=111(Connection refused): server refused to accept
the client]
     [exec] Log Message Received: [2019-07-29 11:16:29,599:5743(0x7f284f7fe700):ZOO_WARN@zookeeper_interest@2316:
Delaying connection after exhaustively trying all servers [127.0.0.1:22181]]
     [exec] Log Message Received: [2019-07-29 11:16:29,766:5743(0x7f284f7fe700):ZOO_ERROR@handle_socket_error_msg@2468:
Socket 127.0.0.1:22181 zk retcode=-4, errno=111(Connection refused): server refused to accept
the client]
     [exec] Log Message Received: [2019-07-29 11:16:29,766:5743(0x7f284f7fe700):ZOO_WARN@zookeeper_interest@2316:
Delaying connection after exhaustively trying all servers [127.0.0.1:22181]]
     [exec] Log Message Received: [2019-07-29 11:16:29,932:5743(0x7f284f7fe700):ZOO_ERROR@handle_socket_error_msg@2468:
Socket 127.0.0.1:22181 zk retcode=-4, errno=111(Connection refused): server refused to accept
the client]
     [exec] Log Message Received: [2019-07-29 11:16:29,932:5743(0x7f284f7fe700):ZOO_WARN@zookeeper_interest@2316:
Delaying connection after exhaustively trying all servers [127.0.0.1:22181]]
     [exec] Log Message Received: [2019-07-29 11:16:30,099:5743(0x7f284f7fe700):ZOO_ERROR@handle_socket_error_msg@2468:
Socket 127.0.0.1:22181 zk retcode=-4, errno=111(Connection refused): server refused to accept
the client]
     [exec] Log Message Received: [2019-07-29 11:16:30,099:5743(0x7f284f7fe700):ZOO_WARN@zookeeper_interest@2316:
Delaying connection after exhaustively trying all servers [127.0.0.1:22181]]
     [exec]  : elapsed 1001 : OK
     [exec] Zookeeper_simpleSystem::testAsyncWatcherAutoResetFAIL: zktest-mt
     [exec] ==========================================
     [exec] 1 of 2 tests failed
     [exec] Please report to user@zookeeper.apache.org
     [exec] ==========================================
     [exec] Makefile:1815: recipe for target 'check-TESTS' failed
     [exec] make[1]: Leaving directory '<https://builds.apache.org/job/zookeeper-master-maven-jdk11/ws/zookeeper-client/zookeeper-client-c/target/c'>
     [exec] Makefile:2071: recipe for target 'check-am' failed
     [exec] terminate called after throwing an instance of 'CppUnit::Exception'
     [exec]   what():  equality assertion failed
     [exec] - Expected: -101
     [exec] - Actual  : -4
     [exec] 
     [exec] /bin/bash: line 5:  5743 Aborted                 ZKROOT=<https://builds.apache.org/job/zookeeper-master-maven-jdk11/ws/zookeeper-client/zookeeper-client-c/../..>
CLASSPATH=$CLASSPATH:$CLOVER_HOME/lib/clover*.jar ${dir}$tst
     [exec] make[1]: *** [check-TESTS] Error 1
     [exec] make: *** [check-am] Error 2
[INFO] ------------------------------------------------------------------------
[INFO] Reactor Summary for Apache ZooKeeper 3.6.0-SNAPSHOT:
[INFO] 
[INFO] Apache ZooKeeper ................................... SUCCESS [ 18.727 s]
[INFO] Apache ZooKeeper - Documentation ................... SUCCESS [  9.557 s]
[INFO] Apache ZooKeeper - Jute ............................ SUCCESS [01:15 min]
[INFO] Apache ZooKeeper - Server .......................... SUCCESS [12:48 min]
[INFO] Apache ZooKeeper - Metrics Providers ............... SUCCESS [  3.171 s]
[INFO] Apache ZooKeeper - Prometheus.io Metrics Provider .. SUCCESS [ 16.902 s]
[INFO] Apache ZooKeeper - Client .......................... SUCCESS [  3.093 s]
[INFO] Apache ZooKeeper - Client - C ...................... FAILURE [05:30 min]
[INFO] Apache ZooKeeper - Recipes ......................... SKIPPED
[INFO] Apache ZooKeeper - Recipes - Election .............. SKIPPED
[INFO] Apache ZooKeeper - Recipes - Lock .................. SKIPPED
[INFO] Apache ZooKeeper - Recipes - Queue ................. SKIPPED
[INFO] Apache ZooKeeper - Assembly ........................ SKIPPED
[INFO] Apache ZooKeeper - Contrib ......................... SKIPPED
[INFO] Apache ZooKeeper - Contrib - Loggraph .............. SKIPPED
[INFO] Apache ZooKeeper - Contrib - Rest .................. SKIPPED
[INFO] Apache ZooKeeper - Contrib - ZooInspector .......... SKIPPED
[INFO] ------------------------------------------------------------------------
[INFO] BUILD FAILURE
[INFO] ------------------------------------------------------------------------
[INFO] Total time:  21:14 min
[INFO] Finished at: 2019-07-29T11:16:49Z
[INFO] ------------------------------------------------------------------------
Waiting for Jenkins to finish collecting data
[ERROR] Failed to execute goal org.apache.maven.plugins:maven-antrun-plugin:1.8:run (test-cppunit)
on project zookeeper-client-c: An Ant BuildException has occured: exec returned: 2
[ERROR] around Ant part ...<exec failonerror="true" dir="<https://builds.apache.org/job/zookeeper-master-maven-jdk11/ws/zookeeper-client/zookeeper-client-c/target/c">
executable="make">... @ 4:164 in <https://builds.apache.org/job/zookeeper-master-maven-jdk11/ws/zookeeper-client/zookeeper-client-c/target/antrun/build-main.xml>
[ERROR] -> [Help 1]
[ERROR] 
[ERROR] To see the full stack trace of the errors, re-run Maven with the -e switch.
[ERROR] Re-run Maven using the -X switch to enable full debug logging.
[ERROR] 
[ERROR] For more information about the errors and possible solutions, please read the following
articles:
[ERROR] [Help 1] http://cwiki.apache.org/confluence/display/MAVEN/MojoExecutionException
[ERROR] 
[ERROR] After correcting the problems, you can resume the build with the command
[ERROR]   mvn <goals> -rf :zookeeper-client-c
[JENKINS] Archiving <https://builds.apache.org/job/zookeeper-master-maven-jdk11/ws/zookeeper-server/pom.xml>
to org.apache.zookeeper/zookeeper/3.6.0-SNAPSHOT/zookeeper-3.6.0-SNAPSHOT.pom
[JENKINS] Archiving <https://builds.apache.org/job/zookeeper-master-maven-jdk11/ws/zookeeper-server/target/zookeeper-3.6.0-SNAPSHOT.jar>
to org.apache.zookeeper/zookeeper/3.6.0-SNAPSHOT/zookeeper-3.6.0-SNAPSHOT.jar
[JENKINS] Archiving <https://builds.apache.org/job/zookeeper-master-maven-jdk11/ws/zookeeper-server/target/zookeeper-3.6.0-SNAPSHOT-tests.jar>
to org.apache.zookeeper/zookeeper/3.6.0-SNAPSHOT/zookeeper-3.6.0-SNAPSHOT-tests.jar
[JENKINS] Archiving <https://builds.apache.org/job/zookeeper-master-maven-jdk11/ws/zookeeper-server/target/zookeeper-3.6.0-SNAPSHOT-sources.jar>
to org.apache.zookeeper/zookeeper/3.6.0-SNAPSHOT/zookeeper-3.6.0-SNAPSHOT-sources.jar
[JENKINS] Archiving <https://builds.apache.org/job/zookeeper-master-maven-jdk11/ws/zookeeper-server/target/zookeeper-3.6.0-SNAPSHOT-javadoc.jar>
to org.apache.zookeeper/zookeeper/3.6.0-SNAPSHOT/zookeeper-3.6.0-SNAPSHOT-javadoc.jar
[JENKINS] Archiving <https://builds.apache.org/job/zookeeper-master-maven-jdk11/ws/zookeeper-contrib/zookeeper-contrib-loggraph/pom.xml>
to org.apache.zookeeper/zookeeper-contrib-loggraph/3.6.0-SNAPSHOT/zookeeper-contrib-loggraph-3.6.0-SNAPSHOT.pom
[JENKINS] Archiving <https://builds.apache.org/job/zookeeper-master-maven-jdk11/ws/zookeeper-metrics-providers/pom.xml>
to org.apache.zookeeper/zookeeper-metrics-providers/3.6.0-SNAPSHOT/zookeeper-metrics-providers-3.6.0-SNAPSHOT.pom
[JENKINS] Archiving <https://builds.apache.org/job/zookeeper-master-maven-jdk11/ws/zookeeper-metrics-providers/zookeeper-prometheus-metrics/pom.xml>
to org.apache.zookeeper/zookeeper-prometheus-metrics/3.6.0-SNAPSHOT/zookeeper-prometheus-metrics-3.6.0-SNAPSHOT.pom
[JENKINS] Archiving <https://builds.apache.org/job/zookeeper-master-maven-jdk11/ws/zookeeper-metrics-providers/zookeeper-prometheus-metrics/target/zookeeper-prometheus-metrics-3.6.0-SNAPSHOT.jar>
to org.apache.zookeeper/zookeeper-prometheus-metrics/3.6.0-SNAPSHOT/zookeeper-prometheus-metrics-3.6.0-SNAPSHOT.jar
[JENKINS] Archiving <https://builds.apache.org/job/zookeeper-master-maven-jdk11/ws/zookeeper-metrics-providers/zookeeper-prometheus-metrics/target/zookeeper-prometheus-metrics-3.6.0-SNAPSHOT-tests.jar>
to org.apache.zookeeper/zookeeper-prometheus-metrics/3.6.0-SNAPSHOT/zookeeper-prometheus-metrics-3.6.0-SNAPSHOT-tests.jar
[JENKINS] Archiving <https://builds.apache.org/job/zookeeper-master-maven-jdk11/ws/zookeeper-metrics-providers/zookeeper-prometheus-metrics/target/zookeeper-prometheus-metrics-3.6.0-SNAPSHOT-sources.jar>
to org.apache.zookeeper/zookeeper-prometheus-metrics/3.6.0-SNAPSHOT/zookeeper-prometheus-metrics-3.6.0-SNAPSHOT-sources.jar
[JENKINS] Archiving <https://builds.apache.org/job/zookeeper-master-maven-jdk11/ws/zookeeper-metrics-providers/zookeeper-prometheus-metrics/target/zookeeper-prometheus-metrics-3.6.0-SNAPSHOT-javadoc.jar>
to org.apache.zookeeper/zookeeper-prometheus-metrics/3.6.0-SNAPSHOT/zookeeper-prometheus-metrics-3.6.0-SNAPSHOT-javadoc.jar
[Fast Archiver] Compressed 445.73 KB of artifacts by 43.1% relative to #63
[JENKINS] Archiving <https://builds.apache.org/job/zookeeper-master-maven-jdk11/ws/zookeeper-recipes/zookeeper-recipes-election/pom.xml>
to org.apache.zookeeper/zookeeper-recipes-election/3.6.0-SNAPSHOT/zookeeper-recipes-election-3.6.0-SNAPSHOT.pom
[JENKINS] Archiving <https://builds.apache.org/job/zookeeper-master-maven-jdk11/ws/pom.xml>
to org.apache.zookeeper/parent/3.6.0-SNAPSHOT/parent-3.6.0-SNAPSHOT.pom
[JENKINS] Archiving <https://builds.apache.org/job/zookeeper-master-maven-jdk11/ws/zookeeper-recipes/zookeeper-recipes-lock/pom.xml>
to org.apache.zookeeper/zookeeper-recipes-lock/3.6.0-SNAPSHOT/zookeeper-recipes-lock-3.6.0-SNAPSHOT.pom
[JENKINS] Archiving <https://builds.apache.org/job/zookeeper-master-maven-jdk11/ws/zookeeper-contrib/pom.xml>
to org.apache.zookeeper/zookeeper-contrib/3.6.0-SNAPSHOT/zookeeper-contrib-3.6.0-SNAPSHOT.pom
[JENKINS] Archiving <https://builds.apache.org/job/zookeeper-master-maven-jdk11/ws/zookeeper-client/pom.xml>
to org.apache.zookeeper/zookeeper-client/3.6.0-SNAPSHOT/zookeeper-client-3.6.0-SNAPSHOT.pom
[JENKINS] Archiving <https://builds.apache.org/job/zookeeper-master-maven-jdk11/ws/zookeeper-jute/pom.xml>
to org.apache.zookeeper/zookeeper-jute/3.6.0-SNAPSHOT/zookeeper-jute-3.6.0-SNAPSHOT.pom
[JENKINS] Archiving <https://builds.apache.org/job/zookeeper-master-maven-jdk11/ws/zookeeper-jute/target/zookeeper-jute-3.6.0-SNAPSHOT.jar>
to org.apache.zookeeper/zookeeper-jute/3.6.0-SNAPSHOT/zookeeper-jute-3.6.0-SNAPSHOT.jar
[JENKINS] Archiving <https://builds.apache.org/job/zookeeper-master-maven-jdk11/ws/zookeeper-jute/target/zookeeper-jute-3.6.0-SNAPSHOT-tests.jar>
to org.apache.zookeeper/zookeeper-jute/3.6.0-SNAPSHOT/zookeeper-jute-3.6.0-SNAPSHOT-tests.jar
[JENKINS] Archiving <https://builds.apache.org/job/zookeeper-master-maven-jdk11/ws/zookeeper-jute/target/zookeeper-jute-3.6.0-SNAPSHOT-sources.jar>
to org.apache.zookeeper/zookeeper-jute/3.6.0-SNAPSHOT/zookeeper-jute-3.6.0-SNAPSHOT-sources.jar
[JENKINS] Archiving <https://builds.apache.org/job/zookeeper-master-maven-jdk11/ws/zookeeper-jute/target/zookeeper-jute-3.6.0-SNAPSHOT-javadoc.jar>
to org.apache.zookeeper/zookeeper-jute/3.6.0-SNAPSHOT/zookeeper-jute-3.6.0-SNAPSHOT-javadoc.jar
[JENKINS] Archiving <https://builds.apache.org/job/zookeeper-master-maven-jdk11/ws/zookeeper-recipes/zookeeper-recipes-queue/pom.xml>
to org.apache.zookeeper/zookeeper-recipes-queue/3.6.0-SNAPSHOT/zookeeper-recipes-queue-3.6.0-SNAPSHOT.pom
[JENKINS] Archiving <https://builds.apache.org/job/zookeeper-master-maven-jdk11/ws/zookeeper-docs/pom.xml>
to org.apache.zookeeper/zookeeper-docs/3.6.0-SNAPSHOT/zookeeper-docs-3.6.0-SNAPSHOT.pom
[JENKINS] Archiving <https://builds.apache.org/job/zookeeper-master-maven-jdk11/ws/zookeeper-docs/target/zookeeper-docs-3.6.0-SNAPSHOT.jar>
to org.apache.zookeeper/zookeeper-docs/3.6.0-SNAPSHOT/zookeeper-docs-3.6.0-SNAPSHOT.jar
[JENKINS] Archiving <https://builds.apache.org/job/zookeeper-master-maven-jdk11/ws/zookeeper-docs/target/zookeeper-docs-3.6.0-SNAPSHOT-tests.jar>
to org.apache.zookeeper/zookeeper-docs/3.6.0-SNAPSHOT/zookeeper-docs-3.6.0-SNAPSHOT-tests.jar
[JENKINS] Archiving <https://builds.apache.org/job/zookeeper-master-maven-jdk11/ws/zookeeper-docs/target/zookeeper-docs-3.6.0-SNAPSHOT-sources.jar>
to org.apache.zookeeper/zookeeper-docs/3.6.0-SNAPSHOT/zookeeper-docs-3.6.0-SNAPSHOT-sources.jar
[JENKINS] Archiving <https://builds.apache.org/job/zookeeper-master-maven-jdk11/ws/zookeeper-recipes/pom.xml>
to org.apache.zookeeper/zookeeper-recipes/3.6.0-SNAPSHOT/zookeeper-recipes-3.6.0-SNAPSHOT.pom
[JENKINS] Archiving <https://builds.apache.org/job/zookeeper-master-maven-jdk11/ws/zookeeper-client/zookeeper-client-c/pom.xml>
to org.apache.zookeeper/zookeeper-client-c/3.6.0-SNAPSHOT/zookeeper-client-c-3.6.0-SNAPSHOT.pom
[JENKINS] Archiving <https://builds.apache.org/job/zookeeper-master-maven-jdk11/ws/zookeeper-contrib/zookeeper-contrib-rest/pom.xml>
to org.apache.zookeeper/zookeeper-contrib-rest/3.6.0-SNAPSHOT/zookeeper-contrib-rest-3.6.0-SNAPSHOT.pom
[JENKINS] Archiving <https://builds.apache.org/job/zookeeper-master-maven-jdk11/ws/zookeeper-assembly/pom.xml>
to org.apache.zookeeper/zookeeper-assembly/3.6.0-SNAPSHOT/zookeeper-assembly-3.6.0-SNAPSHOT.pom
[JENKINS] Archiving <https://builds.apache.org/job/zookeeper-master-maven-jdk11/ws/zookeeper-contrib/zookeeper-contrib-zooinspector/pom.xml>
to org.apache.zookeeper/zookeeper-contrib-zooinspector/3.6.0-SNAPSHOT/zookeeper-contrib-zooinspector-3.6.0-SNAPSHOT.pom
channel stopped
[SpotBugs] Skipping execution of recorder since overall result is 'FAILURE'

Mime
View raw message