zookeeper-dev mailing list archives

Site index · List index
Message view « Date » · « Thread »
Top « Date » · « Thread »
From Apache Jenkins Server <jenk...@builds.apache.org>
Subject ZooKeeper-trunk - Build # 605 - Failure
Date Mon, 08 Jul 2019 22:26:54 GMT
See https://builds.apache.org/job/ZooKeeper-trunk/605/

###################################################################################
########################## LAST 60 LINES OF THE CONSOLE ###########################
[...truncated 190.21 KB...]
    [junit] Tests run: 1, Failures: 0, Errors: 0, Skipped: 0, Time elapsed: 0.756 sec, Thread:
1, Class: org.apache.zookeeper.test.SessionInvalidationTest
    [junit] Running org.apache.zookeeper.test.SessionTest in thread 1
    [junit] Tests run: 6, Failures: 0, Errors: 0, Skipped: 0, Time elapsed: 16.323 sec, Thread:
1, Class: org.apache.zookeeper.test.SessionTest
    [junit] Running org.apache.zookeeper.test.SessionTimeoutTest in thread 1
    [junit] Tests run: 5, Failures: 0, Errors: 0, Skipped: 0, Time elapsed: 1.627 sec, Thread:
1, Class: org.apache.zookeeper.test.SessionTimeoutTest
    [junit] Running org.apache.zookeeper.test.SessionTrackerCheckTest in thread 1
    [junit] Tests run: 2, Failures: 0, Errors: 0, Skipped: 0, Time elapsed: 0.093 sec, Thread:
1, Class: org.apache.zookeeper.test.SessionTrackerCheckTest
    [junit] Running org.apache.zookeeper.test.SessionUpgradeTest in thread 1
    [junit] Tests run: 4, Failures: 0, Errors: 0, Skipped: 0, Time elapsed: 4.932 sec, Thread:
1, Class: org.apache.zookeeper.test.SessionUpgradeTest
    [junit] Running org.apache.zookeeper.test.StandaloneTest in thread 1
    [junit] Tests run: 4, Failures: 0, Errors: 0, Skipped: 0, Time elapsed: 2.898 sec, Thread:
1, Class: org.apache.zookeeper.test.StandaloneTest
    [junit] Running org.apache.zookeeper.test.StatTest in thread 1
    [junit] Tests run: 4, Failures: 0, Errors: 0, Skipped: 0, Time elapsed: 1.216 sec, Thread:
1, Class: org.apache.zookeeper.test.StatTest
    [junit] Running org.apache.zookeeper.test.StaticHostProviderTest in thread 1
    [junit] Tests run: 26, Failures: 0, Errors: 0, Skipped: 0, Time elapsed: 2.202 sec, Thread:
1, Class: org.apache.zookeeper.test.StaticHostProviderTest
    [junit] Running org.apache.zookeeper.test.StringUtilTest in thread 1
    [junit] Tests run: 1, Failures: 0, Errors: 0, Skipped: 0, Time elapsed: 0.073 sec, Thread:
1, Class: org.apache.zookeeper.test.StringUtilTest
    [junit] Running org.apache.zookeeper.test.SyncCallTest in thread 1
    [junit] Tests run: 1, Failures: 0, Errors: 0, Skipped: 0, Time elapsed: 0.852 sec, Thread:
1, Class: org.apache.zookeeper.test.SyncCallTest
    [junit] Running org.apache.zookeeper.test.TruncateTest in thread 1
    [junit] Tests run: 3, Failures: 0, Errors: 0, Skipped: 0, Time elapsed: 5.079 sec, Thread:
1, Class: org.apache.zookeeper.test.TruncateTest
    [junit] Running org.apache.zookeeper.test.WatchEventWhenAutoResetTest in thread 1
    [junit] Tests run: 109, Failures: 0, Errors: 0, Skipped: 0, Time elapsed: 302.106 sec,
Thread: 2, Class: org.apache.zookeeper.test.NettyNettySuiteTest
    [junit] Running org.apache.zookeeper.test.WatchedEventTest in thread 2
    [junit] Tests run: 4, Failures: 0, Errors: 0, Skipped: 0, Time elapsed: 0.08 sec, Thread:
2, Class: org.apache.zookeeper.test.WatchedEventTest
    [junit] Running org.apache.zookeeper.test.WatcherFuncTest in thread 2
    [junit] Tests run: 4, Failures: 0, Errors: 0, Skipped: 0, Time elapsed: 12.927 sec, Thread:
1, Class: org.apache.zookeeper.test.WatchEventWhenAutoResetTest
    [junit] Running org.apache.zookeeper.test.WatcherTest in thread 1
    [junit] Tests run: 6, Failures: 0, Errors: 0, Skipped: 0, Time elapsed: 2.123 sec, Thread:
2, Class: org.apache.zookeeper.test.WatcherFuncTest
    [junit] Running org.apache.zookeeper.test.X509AuthTest in thread 2
    [junit] Tests run: 3, Failures: 0, Errors: 0, Skipped: 0, Time elapsed: 0.094 sec, Thread:
2, Class: org.apache.zookeeper.test.X509AuthTest
    [junit] Running org.apache.zookeeper.test.ZkDatabaseCorruptionTest in thread 2
    [junit] Tests run: 2, Failures: 0, Errors: 0, Skipped: 0, Time elapsed: 3.561 sec, Thread:
2, Class: org.apache.zookeeper.test.ZkDatabaseCorruptionTest
    [junit] Running org.apache.zookeeper.test.ZooKeeperQuotaTest in thread 2
    [junit] Tests run: 1, Failures: 0, Errors: 0, Skipped: 0, Time elapsed: 0.936 sec, Thread:
2, Class: org.apache.zookeeper.test.ZooKeeperQuotaTest
    [junit] Running org.apache.zookeeper.util.PemReaderTest in thread 2
    [junit] Tests run: 64, Failures: 0, Errors: 0, Skipped: 0, Time elapsed: 3.467 sec, Thread:
2, Class: org.apache.zookeeper.util.PemReaderTest
    [junit] Running org.apache.jute.BinaryInputArchiveTest in thread 2
    [junit] Tests run: 7, Failures: 0, Errors: 0, Skipped: 0, Time elapsed: 0.134 sec, Thread:
2, Class: org.apache.jute.BinaryInputArchiveTest
    [junit] Tests run: 8, Failures: 0, Errors: 0, Skipped: 0, Time elapsed: 29.725 sec, Thread:
1, Class: org.apache.zookeeper.test.WatcherTest
    [junit] Tests run: 109, Failures: 0, Errors: 0, Skipped: 0, Time elapsed: 334.63 sec,
Thread: 3, Class: org.apache.zookeeper.test.NioNettySuiteTest
    [junit] Tests run: 13, Failures: 0, Errors: 0, Skipped: 0, Time elapsed: 238.816 sec,
Thread: 4, Class: org.apache.zookeeper.test.ReconfigTest

fail.build.on.test.failure:

BUILD FAILED
/home/jenkins/jenkins-slave/workspace/ZooKeeper-trunk/build.xml:1492: The following error
occurred while executing this line:
/home/jenkins/jenkins-slave/workspace/ZooKeeper-trunk/build.xml:1345: The following error
occurred while executing this line:
/home/jenkins/jenkins-slave/workspace/ZooKeeper-trunk/build.xml:1349: Tests failed!

Total time: 15 minutes 0 seconds
Build step 'Execute shell' marked build as failure
[FINDBUGS] Skipping publisher since build result is FAILURE
[WARNINGS] Skipping publisher since build result is FAILURE
Archiving artifacts
[JIRA] Updating issue ZOOKEEPER-3243
Recording test results
Email was triggered for: Failure - Any
Sending email for trigger: Failure - Any



###################################################################################
############################## FAILED TESTS (if any) ##############################
6 tests failed.
FAILED:  org.apache.zookeeper.server.quorum.FuzzySnapshotRelatedTest.testGlobalSessionConsistency

Error Message:
null

Stack Trace:
java.lang.NullPointerException
	at org.apache.zookeeper.server.quorum.FuzzySnapshotRelatedTest.setup(FuzzySnapshotRelatedTest.java:107)


FAILED:  org.apache.zookeeper.server.quorum.QuorumRequestPipelineTest.testSetAndGetChildren[0]

Error Message:
Forked Java VM exited abnormally. Please note the time in the report does not reflect the
time until the VM exit.

Stack Trace:
junit.framework.AssertionFailedError: Forked Java VM exited abnormally. Please note the time
in the report does not reflect the time until the VM exit.
	at java.lang.Thread.run(Thread.java:748)


FAILED:  org.apache.zookeeper.server.quorum.QuorumSSLTest.testOCSP

Error Message:
null

Stack Trace:
junit.framework.AssertionFailedError
	at org.apache.zookeeper.server.quorum.QuorumSSLTest.testOCSP(QuorumSSLTest.java:658)
	at org.apache.zookeeper.JUnit4ZKTestRunner$LoggedInvokeMethod.evaluate(JUnit4ZKTestRunner.java:80)
	at java.util.concurrent.FutureTask.run(FutureTask.java:266)
	at java.lang.Thread.run(Thread.java:748)


FAILED:  org.apache.zookeeper.server.quorum.RaceConditionTest.testRaceConditionBetweenLeaderAndAckRequestProcessor

Error Message:
Forked Java VM exited abnormally. Please note the time in the report does not reflect the
time until the VM exit.

Stack Trace:
junit.framework.AssertionFailedError: Forked Java VM exited abnormally. Please note the time
in the report does not reflect the time until the VM exit.
	at java.lang.Thread.run(Thread.java:748)


FAILED:  org.apache.zookeeper.server.quorum.StandaloneDisabledTest.startSingleServerTest

Error Message:
Error- Server started in Standalone Mode!

Stack Trace:
junit.framework.AssertionFailedError: Error- Server started in Standalone Mode!
	at org.apache.zookeeper.server.quorum.StandaloneDisabledTest.startServer(StandaloneDisabledTest.java:178)
	at org.apache.zookeeper.server.quorum.StandaloneDisabledTest.startFollowers(StandaloneDisabledTest.java:210)
	at org.apache.zookeeper.server.quorum.StandaloneDisabledTest.startSingleServerTest(StandaloneDisabledTest.java:67)
	at org.apache.zookeeper.JUnit4ZKTestRunner$LoggedInvokeMethod.evaluate(JUnit4ZKTestRunner.java:80)
	at java.util.concurrent.FutureTask.run(FutureTask.java:266)
	at java.lang.Thread.run(Thread.java:748)


FAILED:  org.apache.zookeeper.server.quorum.StandaloneDisabledTest.startObserver

Error Message:
Observer was able to start by itself!

Stack Trace:
junit.framework.AssertionFailedError: Observer was able to start by itself!
	at org.apache.zookeeper.server.quorum.StandaloneDisabledTest.startObserver(StandaloneDisabledTest.java:264)
	at org.apache.zookeeper.JUnit4ZKTestRunner$LoggedInvokeMethod.evaluate(JUnit4ZKTestRunner.java:80)
Mime
  • Unnamed multipart/mixed (inline, None, 0 bytes)
View raw message