zookeeper-dev mailing list archives

Site index · List index
Message view « Date » · « Thread »
Top « Date » · « Thread »
From Apache Jenkins Server <jenk...@builds.apache.org>
Subject ZooKeeper_branch35_jdk8 - Build # 1479 - Still Failing
Date Fri, 19 Jul 2019 15:30:17 GMT
See https://builds.apache.org/job/ZooKeeper_branch35_jdk8/1479/

###################################################################################
########################## LAST 60 LINES OF THE CONSOLE ###########################
[...truncated 67.42 KB...]
    [junit] Tests run: 1, Failures: 0, Errors: 0, Skipped: 0, Time elapsed: 0.901 sec, Thread:
2, Class: org.apache.zookeeper.test.SaslSuperUserTest
    [junit] Running org.apache.zookeeper.test.ServerCnxnTest in thread 2
    [junit] Tests run: 1, Failures: 0, Errors: 0, Skipped: 0, Time elapsed: 57.426 sec, Thread:
3, Class: org.apache.zookeeper.test.RecoveryTest
    [junit] Tests run: 1, Failures: 0, Errors: 0, Skipped: 0, Time elapsed: 43.709 sec, Thread:
4, Class: org.apache.zookeeper.test.RestoreCommittedLogTest
    [junit] Running org.apache.zookeeper.test.SessionInvalidationTest in thread 3
    [junit] Tests run: 1, Failures: 0, Errors: 0, Skipped: 0, Time elapsed: 3.355 sec, Thread:
2, Class: org.apache.zookeeper.test.ServerCnxnTest
    [junit] Running org.apache.zookeeper.test.SessionTest in thread 4
    [junit] Tests run: 1, Failures: 0, Errors: 0, Skipped: 0, Time elapsed: 0.761 sec, Thread:
3, Class: org.apache.zookeeper.test.SessionInvalidationTest
    [junit] Running org.apache.zookeeper.test.SessionTimeoutTest in thread 2
    [junit] Running org.apache.zookeeper.test.SessionTrackerCheckTest in thread 3
    [junit] Tests run: 2, Failures: 0, Errors: 0, Skipped: 0, Time elapsed: 0.085 sec, Thread:
3, Class: org.apache.zookeeper.test.SessionTrackerCheckTest
    [junit] Running org.apache.zookeeper.test.SessionUpgradeTest in thread 3
    [junit] Tests run: 4, Failures: 0, Errors: 0, Skipped: 0, Time elapsed: 1.656 sec, Thread:
2, Class: org.apache.zookeeper.test.SessionTimeoutTest
    [junit] Running org.apache.zookeeper.test.StandaloneTest in thread 2
    [junit] Tests run: 4, Failures: 0, Errors: 0, Skipped: 0, Time elapsed: 2.618 sec, Thread:
2, Class: org.apache.zookeeper.test.StandaloneTest
    [junit] Running org.apache.zookeeper.test.StatTest in thread 2
    [junit] Tests run: 4, Failures: 0, Errors: 0, Skipped: 0, Time elapsed: 1.279 sec, Thread:
2, Class: org.apache.zookeeper.test.StatTest
    [junit] Running org.apache.zookeeper.test.StaticHostProviderTest in thread 2
    [junit] Tests run: 26, Failures: 0, Errors: 0, Skipped: 0, Time elapsed: 2.2 sec, Thread:
2, Class: org.apache.zookeeper.test.StaticHostProviderTest
    [junit] Running org.apache.zookeeper.test.StringUtilTest in thread 2
    [junit] Tests run: 1, Failures: 0, Errors: 0, Skipped: 0, Time elapsed: 0.069 sec, Thread:
2, Class: org.apache.zookeeper.test.StringUtilTest
    [junit] Running org.apache.zookeeper.test.SyncCallTest in thread 2
    [junit] Tests run: 5, Failures: 0, Errors: 0, Skipped: 0, Time elapsed: 12.417 sec, Thread:
4, Class: org.apache.zookeeper.test.SessionTest
    [junit] Running org.apache.zookeeper.test.TruncateTest in thread 4
    [junit] Tests run: 1, Failures: 0, Errors: 0, Skipped: 0, Time elapsed: 0.695 sec, Thread:
2, Class: org.apache.zookeeper.test.SyncCallTest
    [junit] Running org.apache.zookeeper.test.WatchEventWhenAutoResetTest in thread 2
    [junit] Tests run: 3, Failures: 0, Errors: 0, Skipped: 0, Time elapsed: 10.432 sec, Thread:
4, Class: org.apache.zookeeper.test.TruncateTest
    [junit] Running org.apache.zookeeper.test.WatchedEventTest in thread 4
    [junit] Tests run: 4, Failures: 0, Errors: 0, Skipped: 0, Time elapsed: 0.107 sec, Thread:
4, Class: org.apache.zookeeper.test.WatchedEventTest
    [junit] Running org.apache.zookeeper.test.WatcherFuncTest in thread 4
    [junit] Tests run: 4, Failures: 0, Errors: 0, Skipped: 0, Time elapsed: 24.726 sec, Thread:
3, Class: org.apache.zookeeper.test.SessionUpgradeTest
    [junit] Running org.apache.zookeeper.test.WatcherTest in thread 3
    [junit] Tests run: 6, Failures: 0, Errors: 0, Skipped: 0, Time elapsed: 2.841 sec, Thread:
4, Class: org.apache.zookeeper.test.WatcherFuncTest
    [junit] Running org.apache.zookeeper.test.X509AuthTest in thread 4
    [junit] Tests run: 3, Failures: 0, Errors: 0, Skipped: 0, Time elapsed: 0.122 sec, Thread:
4, Class: org.apache.zookeeper.test.X509AuthTest
    [junit] Running org.apache.zookeeper.test.ZkDatabaseCorruptionTest in thread 4
    [junit] Tests run: 4, Failures: 0, Errors: 0, Skipped: 0, Time elapsed: 22.737 sec, Thread:
2, Class: org.apache.zookeeper.test.WatchEventWhenAutoResetTest
    [junit] Running org.apache.zookeeper.test.ZooKeeperQuotaTest in thread 2
    [junit] Tests run: 1, Failures: 0, Errors: 0, Skipped: 0, Time elapsed: 0.785 sec, Thread:
2, Class: org.apache.zookeeper.test.ZooKeeperQuotaTest
    [junit] Running org.apache.zookeeper.util.PemReaderTest in thread 2
    [junit] Tests run: 64, Failures: 0, Errors: 0, Skipped: 0, Time elapsed: 4.372 sec, Thread:
2, Class: org.apache.zookeeper.util.PemReaderTest
    [junit] Running org.apache.jute.BinaryInputArchiveTest in thread 2
    [junit] Tests run: 1, Failures: 0, Errors: 0, Skipped: 0, Time elapsed: 0.076 sec, Thread:
2, Class: org.apache.jute.BinaryInputArchiveTest
    [junit] Tests run: 2, Failures: 0, Errors: 0, Skipped: 0, Time elapsed: 18.744 sec, Thread:
4, Class: org.apache.zookeeper.test.ZkDatabaseCorruptionTest
    [junit] Tests run: 8, Failures: 0, Errors: 0, Skipped: 0, Time elapsed: 31.829 sec, Thread:
3, Class: org.apache.zookeeper.test.WatcherTest
    [junit] Tests run: 13, Failures: 0, Errors: 0, Skipped: 0, Time elapsed: 279.761 sec,
Thread: 1, Class: org.apache.zookeeper.test.ReconfigTest

fail.build.on.test.failure:

BUILD FAILED
/home/jenkins/jenkins-slave/workspace/ZooKeeper_branch35_jdk8/build.xml:1333: The following
error occurred while executing this line:
/home/jenkins/jenkins-slave/workspace/ZooKeeper_branch35_jdk8/build.xml:1337: Tests failed!

Total time: 25 minutes 22 seconds
Build step 'Invoke Ant' marked build as failure
Archiving artifacts
Recording test results
Email was triggered for: Failure - Any
Sending email for trigger: Failure - Any



###################################################################################
############################## FAILED TESTS (if any) ##############################
2 tests failed.
FAILED:  org.apache.zookeeper.test.WatcherTest.testWatcherAutoResetDisabledWithLocal

Error Message:
KeeperErrorCode = ConnectionLoss for /watchtest/child

Stack Trace:
org.apache.zookeeper.KeeperException$ConnectionLossException: KeeperErrorCode = ConnectionLoss
for /watchtest/child
	at org.apache.zookeeper.KeeperException.create(KeeperException.java:102)
	at org.apache.zookeeper.KeeperException.create(KeeperException.java:54)
	at org.apache.zookeeper.ZooKeeper.setData(ZooKeeper.java:2384)
	at org.apache.zookeeper.test.WatcherTest.testWatcherAutoReset(WatcherTest.java:357)
	at org.apache.zookeeper.test.WatcherTest.testWatcherAutoResetWithLocal(WatcherTest.java:307)
	at org.apache.zookeeper.test.WatcherTest.testWatcherAutoResetDisabledWithLocal(WatcherTest.java:323)
	at org.apache.zookeeper.JUnit4ZKTestRunner$LoggedInvokeMethod.evaluate(JUnit4ZKTestRunner.java:80)


FAILED:  org.apache.zookeeper.test.QuorumHammerTest.testHammerBasic

Error Message:
expected:<1000> but was:<715>

Stack Trace:
junit.framework.AssertionFailedError: expected:<1000> but was:<715>
	at org.apache.zookeeper.test.ClientHammerTest.verifyHammer(ClientHammerTest.java:231)
	at org.apache.zookeeper.test.ClientHammerTest.runHammer(ClientHammerTest.java:142)
	at org.apache.zookeeper.test.ClientHammerTest.testHammerBasic(ClientHammerTest.java:120)
	at org.apache.zookeeper.test.QuorumHammerTest.testHammerBasic(QuorumHammerTest.java:49)
	at org.apache.zookeeper.JUnit4ZKTestRunner$LoggedInvokeMethod.evaluate(JUnit4ZKTestRunner.java:80)
Mime
  • Unnamed multipart/mixed (inline, None, 0 bytes)
View raw message