zookeeper-dev mailing list archives

Site index · List index
Message view « Date » · « Thread »
Top « Date » · « Thread »
From Apache Jenkins Server <jenk...@builds.apache.org>
Subject ZooKeeper-trunk - Build # 572 - Failure
Date Mon, 17 Jun 2019 00:12:09 GMT
See https://builds.apache.org/job/ZooKeeper-trunk/572/

###################################################################################
########################## LAST 60 LINES OF THE CONSOLE ###########################
[...truncated 325.41 KB...]
     [exec] Log Message Received: [2019-06-17 00:10:38,278:17019(0x2b407d996f40):ZOO_INFO@testLogCallbackInit@1032:
testLogCallbackInit #8]
     [exec] Log Message Received: [2019-06-17 00:10:38,278:17019(0x2b407d996f40):ZOO_INFO@testLogCallbackInit@1032:
testLogCallbackInit #9]
     [exec] Log Message Received: [2019-06-17 00:10:38,278:17019(0x2b407d996f40):ZOO_INFO@zookeeper_close@3255:
Closing zookeeper sessionId=0x1015f06a908000f to 127.0.0.1:22181
     [exec] ]
     [exec]  : elapsed 1000 : OK
     [exec] Zookeeper_simpleSystem::testLogCallbackClearLog Message Received: [2019-06-17
00:10:38,278:17019(0x2b407d996f40):ZOO_INFO@log_env@1098: Client environment:zookeeper.version=zookeeper
C client 3.6.0]
     [exec] Log Message Received: [2019-06-17 00:10:38,278:17019(0x2b407d996f40):ZOO_INFO@log_env@1102:
Client environment:host.name=asf904.gq1.ygridcore.net]
     [exec] Log Message Received: [2019-06-17 00:10:38,279:17019(0x2b407d996f40):ZOO_INFO@log_env@1109:
Client environment:os.name=Linux]
     [exec] Log Message Received: [2019-06-17 00:10:38,279:17019(0x2b407d996f40):ZOO_INFO@log_env@1110:
Client environment:os.arch=4.4.0-139-generic]
     [exec] Log Message Received: [2019-06-17 00:10:38,279:17019(0x2b407d996f40):ZOO_INFO@log_env@1111:
Client environment:os.version=#165~14.04.1-Ubuntu SMP Wed Oct 31 10:55:11 UTC 2018]
     [exec] Log Message Received: [2019-06-17 00:10:38,279:17019(0x2b407d996f40):ZOO_INFO@log_env@1119:
Client environment:user.name=jenkins]
     [exec] Log Message Received: [2019-06-17 00:10:38,279:17019(0x2b407d996f40):ZOO_INFO@log_env@1127:
Client environment:user.home=/home/jenkins]
     [exec] Log Message Received: [2019-06-17 00:10:38,279:17019(0x2b407d996f40):ZOO_INFO@log_env@1139:
Client environment:user.dir=/home/jenkins/jenkins-slave/workspace/ZooKeeper-trunk/build/test/test-cppunit]
     [exec] Log Message Received: [2019-06-17 00:10:38,279:17019(0x2b407d996f40):ZOO_INFO@zookeeper_init_internal@1185:
Initiating client connection, host=127.0.0.1:22181 sessionTimeout=10000 watcher=0x464860 sessionId=0
sessionPasswd=<null> context=0x7ffe2e4ed9a0 flags=0]
     [exec] Log Message Received: [2019-06-17 00:10:38,279:17019(0x2b407fbfa700):ZOO_INFO@check_events@2472:
initiated connection to server 127.0.0.1:22181]
     [exec] Log Message Received: [2019-06-17 00:10:38,281:17019(0x2b407fbfa700):ZOO_INFO@check_events@2524:
session establishment complete on server 127.0.0.1:22181, sessionId=0x1015f06a9080010, negotiated
timeout=10000 ]
     [exec]  : elapsed 1001 : OK
     [exec] Zookeeper_simpleSystem::testAsyncWatcherAutoReset ZooKeeper server started : elapsed
10415 : OK
     [exec] Zookeeper_simpleSystem::testDeserializeString : elapsed 0 : OK
     [exec] Zookeeper_simpleSystem::testFirstServerDown : elapsed 1001 : OK
     [exec] Zookeeper_simpleSystem::testNonexistentHost : elapsed 1056 : OK
     [exec] Zookeeper_simpleSystem::testNullData : elapsed 1020 : OK
     [exec] Zookeeper_simpleSystem::testIPV6 : elapsed 1003 : OK
     [exec] Zookeeper_simpleSystem::testCreate : elapsed 1006 : OK
     [exec] Zookeeper_simpleSystem::testCreateContainer : elapsed 1004 : OK
     [exec] Zookeeper_simpleSystem::testCreateTtl : elapsed 2007 : OK
     [exec] Zookeeper_simpleSystem::testPath : elapsed 1010 : OK
     [exec] Zookeeper_simpleSystem::testPathValidation : elapsed 1029 : OK
     [exec] Zookeeper_simpleSystem::testPing : elapsed 17125 : OK
     [exec] Zookeeper_simpleSystem::testAcl : elapsed 1010 : OK
     [exec] Zookeeper_simpleSystem::testChroot : elapsed 3025 : OK
     [exec] Zookeeper_simpleSystem::testAuthFAIL: zktest-mt
     [exec] ==========================================
     [exec] 1 of 2 tests failed
     [exec] Please report to user@zookeeper.apache.org
     [exec] ==========================================
     [exec] make[1]: Leaving directory `/home/jenkins/jenkins-slave/workspace/ZooKeeper-trunk/build/test/test-cppunit'
     [exec] terminate called after throwing an instance of 'CppUnit::Exception'
     [exec]   what():  equality assertion failed
     [exec] - Expected: 0
     [exec] - Actual  : -116
     [exec] 
     [exec] /bin/bash: line 5: 17019 Aborted                 ZKROOT=/home/jenkins/jenkins-slave/workspace/ZooKeeper-trunk/zookeeper-client/zookeeper-client-c/../..
CLASSPATH=$CLASSPATH:$CLOVER_HOME/lib/clover*.jar ${dir}$tst
     [exec] make[1]: *** [check-TESTS] Error 1
     [exec] make: *** [check-am] Error 2

BUILD FAILED
/home/jenkins/jenkins-slave/workspace/ZooKeeper-trunk/build.xml:1489: The following error
occurred while executing this line:
/home/jenkins/jenkins-slave/workspace/ZooKeeper-trunk/build.xml:1449: The following error
occurred while executing this line:
/home/jenkins/jenkins-slave/workspace/ZooKeeper-trunk/build.xml:1459: exec returned: 2

Total time: 23 minutes 34 seconds
Build step 'Execute shell' marked build as failure
[FINDBUGS] Skipping publisher since build result is FAILURE
[WARNINGS] Skipping publisher since build result is FAILURE
Archiving artifacts
Recording test results
Email was triggered for: Failure - Any
Sending email for trigger: Failure - Any



###################################################################################
############################## FAILED TESTS (if any) ##############################
All tests passed
Mime
  • Unnamed multipart/mixed (inline, None, 0 bytes)
View raw message