zookeeper-dev mailing list archives

Site index · List index
Message view « Date » · « Thread »
Top « Date » · « Thread »
From Apache Jenkins Server <jenk...@builds.apache.org>
Subject Build failed in Jenkins: zookeeper-master-maven-owasp #1
Date Sat, 22 Jun 2019 22:25:39 GMT
See <https://builds.apache.org/job/zookeeper-master-maven-owasp/1/display/redirect>

------------------------------------------
Started by user eolivelli
[EnvInject] - Loading node environment variables.
Building remotely on H9 (Hadoop) in workspace <https://builds.apache.org/job/zookeeper-master-maven-owasp/ws/>
[WS-CLEANUP] Deleting project workspace...
[WS-CLEANUP] Deferred wipeout is used...
No credentials specified
Cloning the remote Git repository
Using shallow clone
Avoid fetching tags
Cloning repository https://github.com/apache/zookeeper
 > git init <https://builds.apache.org/job/zookeeper-master-maven-owasp/ws/> # timeout=10
Fetching upstream changes from https://github.com/apache/zookeeper
 > git --version # timeout=10
 > git fetch --no-tags --progress https://github.com/apache/zookeeper +refs/heads/*:refs/remotes/origin/*
--depth=1
 > git config remote.origin.url https://github.com/apache/zookeeper # timeout=10
 > git config --add remote.origin.fetch +refs/heads/*:refs/remotes/origin/* # timeout=10
 > git config remote.origin.url https://github.com/apache/zookeeper # timeout=10
Fetching upstream changes from https://github.com/apache/zookeeper
 > git fetch --no-tags --progress https://github.com/apache/zookeeper +refs/heads/*:refs/remotes/origin/*
--depth=1
 > git rev-parse refs/remotes/origin/master^{commit} # timeout=10
 > git rev-parse refs/remotes/origin/origin/master^{commit} # timeout=10
Checking out Revision 92257ef143ac94c37941600474d30fe22e1a1a6e (refs/remotes/origin/master)
 > git config core.sparsecheckout # timeout=10
 > git checkout -f 92257ef143ac94c37941600474d30fe22e1a1a6e
Commit message: "ZOOKEEPER-3391: Drop unused RecFormat(CSV/XML)"
First time build. Skipping changelog.
Parsing POMs
Discovered a new module org.apache.zookeeper:parent Apache ZooKeeper
Discovered a new module org.apache.zookeeper:zookeeper-docs Apache ZooKeeper - Documentation
Discovered a new module org.apache.zookeeper:zookeeper-jute Apache ZooKeeper - Jute
Discovered a new module org.apache.zookeeper:zookeeper Apache ZooKeeper - Server
Discovered a new module org.apache.zookeeper:zookeeper-metrics-providers Apache ZooKeeper
- Metrics Providers
Discovered a new module org.apache.zookeeper:zookeeper-prometheus-metrics Apache ZooKeeper
- Prometheus.io Metrics Provider
Discovered a new module org.apache.zookeeper:zookeeper-client Apache ZooKeeper - Client
Discovered a new module org.apache.zookeeper:zookeeper-recipes Apache ZooKeeper - Recipes
Discovered a new module org.apache.zookeeper:zookeeper-recipes-election Apache ZooKeeper -
Recipes - Election
Discovered a new module org.apache.zookeeper:zookeeper-recipes-lock Apache ZooKeeper - Recipes
- Lock
Discovered a new module org.apache.zookeeper:zookeeper-recipes-queue Apache ZooKeeper - Recipes
- Queue
Discovered a new module org.apache.zookeeper:zookeeper-assembly Apache ZooKeeper - Assembly
Modules changed, recalculating dependency graph
Established TCP socket on 46573
maven35-agent.jar already up to date
maven35-interceptor.jar already up to date
maven3-interceptor-commons.jar already up to date
[zookeeper-master-maven-owasp] $ /home/jenkins/tools/java/latest1.8/bin/java -Xmx4g -Xms4g
-cp /home/jenkins/jenkins-slave/maven35-agent.jar:/home/jenkins/tools/maven/apache-maven-3.6.0/boot/plexus-classworlds-2.5.2.jar:/home/jenkins/tools/maven/apache-maven-3.6.0/conf/logging
jenkins.maven3.agent.Maven35Main /home/jenkins/tools/maven/apache-maven-3.6.0 /home/jenkins/jenkins-slave/remoting.jar
/home/jenkins/jenkins-slave/maven35-interceptor.jar /home/jenkins/jenkins-slave/maven3-interceptor-commons.jar
46573
<===[JENKINS REMOTING CAPACITY]===>   channel started
Executing Maven:  -B -f <https://builds.apache.org/job/zookeeper-master-maven-owasp/ws/pom.xml>
-Dmaven.repo.local=/home/jenkins/jenkins-slave/maven-repositories/1 clean package -DskipTests
dependency-check:check
[INFO] Scanning for projects...
[INFO] ------------------------------------------------------------------------
[INFO] Reactor Build Order:
[INFO] 
[INFO] Apache ZooKeeper                                                   [pom]
[INFO] Apache ZooKeeper - Documentation                                   [jar]
[INFO] Apache ZooKeeper - Jute                                            [jar]
[INFO] Apache ZooKeeper - Server                                          [jar]
[INFO] Apache ZooKeeper - Metrics Providers                               [pom]
[INFO] Apache ZooKeeper - Prometheus.io Metrics Provider                  [jar]
[INFO] Apache ZooKeeper - Client                                          [pom]
[INFO] Apache ZooKeeper - Recipes                                         [pom]
[INFO] Apache ZooKeeper - Recipes - Election                              [jar]
[INFO] Apache ZooKeeper - Recipes - Lock                                  [jar]
[INFO] Apache ZooKeeper - Recipes - Queue                                 [jar]
[INFO] Apache ZooKeeper - Assembly                                        [pom]
[INFO] Downloading from central: https://repo.maven.apache.org/maven2/org/owasp/dependency-check-maven/4.0.2/dependency-check-maven-4.0.2.pom
[INFO] Downloaded from central: https://repo.maven.apache.org/maven2/org/owasp/dependency-check-maven/4.0.2/dependency-check-maven-4.0.2.pom
(9.4 kB at 34 kB/s)
[INFO] Downloading from central: https://repo.maven.apache.org/maven2/org/owasp/dependency-check-parent/4.0.2/dependency-check-parent-4.0.2.pom
[INFO] Downloaded from central: https://repo.maven.apache.org/maven2/org/owasp/dependency-check-parent/4.0.2/dependency-check-parent-4.0.2.pom
(50 kB at 2.2 MB/s)
[INFO] Downloading from central: https://repo.maven.apache.org/maven2/org/owasp/dependency-check-maven/4.0.2/dependency-check-maven-4.0.2.jar
[INFO] Downloaded from central: https://repo.maven.apache.org/maven2/org/owasp/dependency-check-maven/4.0.2/dependency-check-maven-4.0.2.jar
(80 kB at 4.0 MB/s)
[INFO] 
[INFO] --------------------< org.apache.zookeeper:parent >---------------------
[INFO] Building Apache ZooKeeper 3.6.0-SNAPSHOT                          [1/12]
[INFO] --------------------------------[ pom ]---------------------------------
[INFO] 
[INFO] --- maven-clean-plugin:3.0.0:clean (default-clean) @ parent ---
[INFO] 
[INFO] --- git-commit-id-plugin:2.2.5:revision (find-current-git-revision) @ parent ---
[INFO] ------------------------------------------------------------------------
[INFO] Reactor Summary for Apache ZooKeeper 3.6.0-SNAPSHOT:
[INFO] 
[INFO] Apache ZooKeeper ................................... FAILURE [  5.984 s]
[INFO] Apache ZooKeeper - Documentation ................... SKIPPED
[INFO] Apache ZooKeeper - Jute ............................ SKIPPED
[INFO] Apache ZooKeeper - Server .......................... SKIPPED
[INFO] Apache ZooKeeper - Metrics Providers ............... SKIPPED
[INFO] Apache ZooKeeper - Prometheus.io Metrics Provider .. SKIPPED
[INFO] Apache ZooKeeper - Client .......................... SKIPPED
[INFO] Apache ZooKeeper - Recipes ......................... SKIPPED
[INFO] Apache ZooKeeper - Recipes - Election .............. SKIPPED
[INFO] Apache ZooKeeper - Recipes - Lock .................. SKIPPED
[INFO] Apache ZooKeeper - Recipes - Queue ................. SKIPPED
[INFO] Apache ZooKeeper - Assembly ........................ SKIPPED
[INFO] ------------------------------------------------------------------------
[INFO] BUILD FAILURE
[INFO] ------------------------------------------------------------------------
[INFO] Total time:  22.702 s
[INFO] Finished at: 2019-06-22T22:25:12Z
[INFO] ------------------------------------------------------------------------
Waiting for Jenkins to finish collecting data
[ERROR] Failed to execute goal pl.project13.maven:git-commit-id-plugin:2.2.5:revision (find-current-git-revision)
on project parent: Could not complete Mojo execution... Unable to find commits until some
tag: Walk failure. Missing commit 52dcf72b0a035116f83431e30c7acf7301982a28 -> [Help 1]
[ERROR] 
[ERROR] To see the full stack trace of the errors, re-run Maven with the -e switch.
[ERROR] Re-run Maven using the -X switch to enable full debug logging.
[ERROR] 
[ERROR] For more information about the errors and possible solutions, please read the following
articles:
[ERROR] [Help 1] http://cwiki.apache.org/confluence/display/MAVEN/MojoExecutionException
[JENKINS] Archiving <https://builds.apache.org/job/zookeeper-master-maven-owasp/ws/zookeeper-server/pom.xml>
to org.apache.zookeeper/zookeeper/3.6.0-SNAPSHOT/zookeeper-3.6.0-SNAPSHOT.pom
[Fast Archiver] No prior successful build to compare, so performing full copy of artifacts
[JENKINS] Archiving <https://builds.apache.org/job/zookeeper-master-maven-owasp/ws/zookeeper-client/pom.xml>
to org.apache.zookeeper/zookeeper-client/3.6.0-SNAPSHOT/zookeeper-client-3.6.0-SNAPSHOT.pom
[Fast Archiver] No prior successful build to compare, so performing full copy of artifacts
[JENKINS] Archiving <https://builds.apache.org/job/zookeeper-master-maven-owasp/ws/zookeeper-jute/pom.xml>
to org.apache.zookeeper/zookeeper-jute/3.6.0-SNAPSHOT/zookeeper-jute-3.6.0-SNAPSHOT.pom
[Fast Archiver] No prior successful build to compare, so performing full copy of artifacts
[JENKINS] Archiving <https://builds.apache.org/job/zookeeper-master-maven-owasp/ws/zookeeper-metrics-providers/pom.xml>
to org.apache.zookeeper/zookeeper-metrics-providers/3.6.0-SNAPSHOT/zookeeper-metrics-providers-3.6.0-SNAPSHOT.pom
[Fast Archiver] No prior successful build to compare, so performing full copy of artifacts
[JENKINS] Archiving <https://builds.apache.org/job/zookeeper-master-maven-owasp/ws/zookeeper-metrics-providers/zookeeper-prometheus-metrics/pom.xml>
to org.apache.zookeeper/zookeeper-prometheus-metrics/3.6.0-SNAPSHOT/zookeeper-prometheus-metrics-3.6.0-SNAPSHOT.pom
[Fast Archiver] No prior successful build to compare, so performing full copy of artifacts
[JENKINS] Archiving <https://builds.apache.org/job/zookeeper-master-maven-owasp/ws/zookeeper-recipes/zookeeper-recipes-election/pom.xml>
to org.apache.zookeeper/zookeeper-recipes-election/3.6.0-SNAPSHOT/zookeeper-recipes-election-3.6.0-SNAPSHOT.pom
[Fast Archiver] No prior successful build to compare, so performing full copy of artifacts
[JENKINS] Archiving <https://builds.apache.org/job/zookeeper-master-maven-owasp/ws/zookeeper-recipes/zookeeper-recipes-queue/pom.xml>
to org.apache.zookeeper/zookeeper-recipes-queue/3.6.0-SNAPSHOT/zookeeper-recipes-queue-3.6.0-SNAPSHOT.pom
[Fast Archiver] No prior successful build to compare, so performing full copy of artifacts
[JENKINS] Archiving <https://builds.apache.org/job/zookeeper-master-maven-owasp/ws/zookeeper-docs/pom.xml>
to org.apache.zookeeper/zookeeper-docs/3.6.0-SNAPSHOT/zookeeper-docs-3.6.0-SNAPSHOT.pom
[Fast Archiver] No prior successful build to compare, so performing full copy of artifacts
[JENKINS] Archiving <https://builds.apache.org/job/zookeeper-master-maven-owasp/ws/zookeeper-recipes/pom.xml>
to org.apache.zookeeper/zookeeper-recipes/3.6.0-SNAPSHOT/zookeeper-recipes-3.6.0-SNAPSHOT.pom
[Fast Archiver] No prior successful build to compare, so performing full copy of artifacts
[JENKINS] Archiving <https://builds.apache.org/job/zookeeper-master-maven-owasp/ws/pom.xml>
to org.apache.zookeeper/parent/3.6.0-SNAPSHOT/parent-3.6.0-SNAPSHOT.pom
[Fast Archiver] No prior successful build to compare, so performing full copy of artifacts
[JENKINS] Archiving <https://builds.apache.org/job/zookeeper-master-maven-owasp/ws/zookeeper-recipes/zookeeper-recipes-lock/pom.xml>
to org.apache.zookeeper/zookeeper-recipes-lock/3.6.0-SNAPSHOT/zookeeper-recipes-lock-3.6.0-SNAPSHOT.pom
[Fast Archiver] No prior successful build to compare, so performing full copy of artifacts
[JENKINS] Archiving <https://builds.apache.org/job/zookeeper-master-maven-owasp/ws/zookeeper-assembly/pom.xml>
to org.apache.zookeeper/zookeeper-assembly/3.6.0-SNAPSHOT/zookeeper-assembly-3.6.0-SNAPSHOT.pom
[Fast Archiver] No prior successful build to compare, so performing full copy of artifacts
channel stopped
[SpotBugs] Skipping execution of recorder since overall result is 'FAILURE'

Mime
View raw message