zookeeper-dev mailing list archives

Site index · List index
Message view « Date » · « Thread »
Top « Date » · « Thread »
From Apache Jenkins Server <jenk...@builds.apache.org>
Subject Build failed in Jenkins: zookeeper-master-maven-jdk11 #1
Date Sat, 22 Jun 2019 22:18:14 GMT
See <https://builds.apache.org/job/zookeeper-master-maven-jdk11/1/display/redirect>

------------------------------------------
Started by user eolivelli
[EnvInject] - Loading node environment variables.
Building remotely on H16 (Hadoop xenial) in workspace <https://builds.apache.org/job/zookeeper-master-maven-jdk11/ws/>
[WS-CLEANUP] Deleting project workspace...
[WS-CLEANUP] Deferred wipeout is used...
No credentials specified
Cloning the remote Git repository
Using shallow clone
Avoid fetching tags
Cloning repository https://github.com/apache/zookeeper
 > git init <https://builds.apache.org/job/zookeeper-master-maven-jdk11/ws/> # timeout=10
Fetching upstream changes from https://github.com/apache/zookeeper
 > git --version # timeout=10
 > git fetch --no-tags --progress https://github.com/apache/zookeeper +refs/heads/*:refs/remotes/origin/*
--depth=1
 > git config remote.origin.url https://github.com/apache/zookeeper # timeout=10
 > git config --add remote.origin.fetch +refs/heads/*:refs/remotes/origin/* # timeout=10
 > git config remote.origin.url https://github.com/apache/zookeeper # timeout=10
Fetching upstream changes from https://github.com/apache/zookeeper
 > git fetch --no-tags --progress https://github.com/apache/zookeeper +refs/heads/*:refs/remotes/origin/*
--depth=1
 > git rev-parse refs/remotes/origin/master^{commit} # timeout=10
 > git rev-parse refs/remotes/origin/origin/master^{commit} # timeout=10
Checking out Revision 92257ef143ac94c37941600474d30fe22e1a1a6e (refs/remotes/origin/master)
 > git config core.sparsecheckout # timeout=10
 > git checkout -f 92257ef143ac94c37941600474d30fe22e1a1a6e
Commit message: "ZOOKEEPER-3391: Drop unused RecFormat(CSV/XML)"
First time build. Skipping changelog.
Parsing POMs
Discovered a new module org.apache.zookeeper:parent Apache ZooKeeper
Discovered a new module org.apache.zookeeper:zookeeper-docs Apache ZooKeeper - Documentation
Discovered a new module org.apache.zookeeper:zookeeper-jute Apache ZooKeeper - Jute
Discovered a new module org.apache.zookeeper:zookeeper Apache ZooKeeper - Server
Discovered a new module org.apache.zookeeper:zookeeper-metrics-providers Apache ZooKeeper
- Metrics Providers
Discovered a new module org.apache.zookeeper:zookeeper-prometheus-metrics Apache ZooKeeper
- Prometheus.io Metrics Provider
Discovered a new module org.apache.zookeeper:zookeeper-client Apache ZooKeeper - Client
Discovered a new module org.apache.zookeeper:zookeeper-client-c Apache ZooKeeper - Client
- C
Discovered a new module org.apache.zookeeper:zookeeper-recipes Apache ZooKeeper - Recipes
Discovered a new module org.apache.zookeeper:zookeeper-recipes-election Apache ZooKeeper -
Recipes - Election
Discovered a new module org.apache.zookeeper:zookeeper-recipes-lock Apache ZooKeeper - Recipes
- Lock
Discovered a new module org.apache.zookeeper:zookeeper-recipes-queue Apache ZooKeeper - Recipes
- Queue
Discovered a new module org.apache.zookeeper:zookeeper-assembly Apache ZooKeeper - Assembly
Discovered a new module org.apache.zookeeper:zookeeper-contrib Apache ZooKeeper - Contrib
Discovered a new module org.apache.zookeeper:zookeeper-contrib-loggraph Apache ZooKeeper -
Contrib - Loggraph
Discovered a new module org.apache.zookeeper:zookeeper-contrib-rest Apache ZooKeeper - Contrib
- Rest
Discovered a new module org.apache.zookeeper:zookeeper-contrib-zooinspector Apache ZooKeeper
- Contrib - ZooInspector
Modules changed, recalculating dependency graph
Established TCP socket on 41223
maven35-agent.jar already up to date
maven35-interceptor.jar already up to date
maven3-interceptor-commons.jar already up to date
[zookeeper-master-maven-jdk11] $ /home/jenkins/tools/java/latest11/bin/java -Xmx4g -Xms4g
-cp /home/jenkins/jenkins-slave/maven35-agent.jar:/home/jenkins/tools/maven/apache-maven-3.6.0/boot/plexus-classworlds-2.5.2.jar:/home/jenkins/tools/maven/apache-maven-3.6.0/conf/logging
jenkins.maven3.agent.Maven35Main /home/jenkins/tools/maven/apache-maven-3.6.0 /home/jenkins/jenkins-slave/remoting.jar
/home/jenkins/jenkins-slave/maven35-interceptor.jar /home/jenkins/jenkins-slave/maven3-interceptor-commons.jar
41223
<===[JENKINS REMOTING CAPACITY]===>   channel started
Executing Maven:  -B -f <https://builds.apache.org/job/zookeeper-master-maven-jdk11/ws/pom.xml>
-Dmaven.repo.local=/home/jenkins/jenkins-slave/maven-repositories/0 apache-rat:check verify
spotbugs:check checkstyle:check -Pfull-build
[INFO] Scanning for projects...
[INFO] ------------------------------------------------------------------------
[INFO] Reactor Build Order:
[INFO] 
[INFO] Apache ZooKeeper                                                   [pom]
[INFO] Apache ZooKeeper - Documentation                                   [jar]
[INFO] Apache ZooKeeper - Jute                                            [jar]
[INFO] Apache ZooKeeper - Server                                          [jar]
[INFO] Apache ZooKeeper - Metrics Providers                               [pom]
[INFO] Apache ZooKeeper - Prometheus.io Metrics Provider                  [jar]
[INFO] Apache ZooKeeper - Client                                          [pom]
[INFO] Apache ZooKeeper - Client - C                                      [jar]
[INFO] Apache ZooKeeper - Recipes                                         [pom]
[INFO] Apache ZooKeeper - Recipes - Election                              [jar]
[INFO] Apache ZooKeeper - Recipes - Lock                                  [jar]
[INFO] Apache ZooKeeper - Recipes - Queue                                 [jar]
[INFO] Apache ZooKeeper - Assembly                                        [pom]
[INFO] Apache ZooKeeper - Contrib                                         [pom]
[INFO] Apache ZooKeeper - Contrib - Loggraph                              [jar]
[INFO] Apache ZooKeeper - Contrib - Rest                                  [jar]
[INFO] Apache ZooKeeper - Contrib - ZooInspector                          [jar]
[INFO] Downloading from central: https://repo.maven.apache.org/maven2/org/owasp/dependency-check-maven/4.0.2/dependency-check-maven-4.0.2.pom
[INFO] Downloaded from central: https://repo.maven.apache.org/maven2/org/owasp/dependency-check-maven/4.0.2/dependency-check-maven-4.0.2.pom
(9.4 kB at 27 kB/s)
[INFO] Downloading from central: https://repo.maven.apache.org/maven2/org/owasp/dependency-check-parent/4.0.2/dependency-check-parent-4.0.2.pom
[INFO] Downloaded from central: https://repo.maven.apache.org/maven2/org/owasp/dependency-check-parent/4.0.2/dependency-check-parent-4.0.2.pom
(50 kB at 1.6 MB/s)
[INFO] Downloading from central: https://repo.maven.apache.org/maven2/org/owasp/dependency-check-maven/4.0.2/dependency-check-maven-4.0.2.jar
[INFO] Downloaded from central: https://repo.maven.apache.org/maven2/org/owasp/dependency-check-maven/4.0.2/dependency-check-maven-4.0.2.jar
(80 kB at 3.3 MB/s)
[INFO] 
[INFO] --------------------< org.apache.zookeeper:parent >---------------------
[INFO] Building Apache ZooKeeper 3.6.0-SNAPSHOT                          [1/17]
[INFO] --------------------------------[ pom ]---------------------------------
[INFO] 
[INFO] --- apache-rat-plugin:0.11:check (default-cli) @ parent ---
[INFO] Downloading from central: https://repo.maven.apache.org/maven2/org/apache/rat/apache-rat-core/0.11/apache-rat-core-0.11.pom
[INFO] Downloaded from central: https://repo.maven.apache.org/maven2/org/apache/rat/apache-rat-core/0.11/apache-rat-core-0.11.pom
(4.3 kB at 241 kB/s)
[INFO] Downloading from central: https://repo.maven.apache.org/maven2/org/apache/maven/shared/maven-plugin-testing-harness/1.1/maven-plugin-testing-harness-1.1.pom
[INFO] Downloaded from central: https://repo.maven.apache.org/maven2/org/apache/maven/shared/maven-plugin-testing-harness/1.1/maven-plugin-testing-harness-1.1.pom
(6.3 kB at 373 kB/s)
[INFO] Downloading from central: https://repo.maven.apache.org/maven2/org/apache/maven/shared/maven-shared-components/7/maven-shared-components-7.pom
[INFO] Downloaded from central: https://repo.maven.apache.org/maven2/org/apache/maven/shared/maven-shared-components/7/maven-shared-components-7.pom
(2.6 kB at 162 kB/s)
[INFO] Downloading from central: https://repo.maven.apache.org/maven2/org/apache/maven/maven-core/2.0/maven-core-2.0.pom
[INFO] Downloaded from central: https://repo.maven.apache.org/maven2/org/apache/maven/maven-core/2.0/maven-core-2.0.pom
(5.6 kB at 311 kB/s)
[INFO] Downloading from central: https://repo.maven.apache.org/maven2/org/apache/maven/maven-settings/2.0/maven-settings-2.0.pom
[INFO] Downloaded from central: https://repo.maven.apache.org/maven2/org/apache/maven/maven-settings/2.0/maven-settings-2.0.pom
(1.4 kB at 81 kB/s)
[INFO] Downloading from central: https://repo.maven.apache.org/maven2/org/apache/maven/maven-plugin-parameter-documenter/2.0/maven-plugin-parameter-documenter-2.0.pom
[INFO] Downloaded from central: https://repo.maven.apache.org/maven2/org/apache/maven/maven-plugin-parameter-documenter/2.0/maven-plugin-parameter-documenter-2.0.pom
(1.5 kB at 117 kB/s)
[INFO] Downloading from central: https://repo.maven.apache.org/maven2/org/apache/maven/reporting/maven-reporting-api/2.0/maven-reporting-api-2.0.pom
[INFO] Downloaded from central: https://repo.maven.apache.org/maven2/org/apache/maven/reporting/maven-reporting-api/2.0/maven-reporting-api-2.0.pom
(1.1 kB at 85 kB/s)
[INFO] Downloading from central: https://repo.maven.apache.org/maven2/org/apache/maven/reporting/maven-reporting/2.0/maven-reporting-2.0.pom
[INFO] Downloaded from central: https://repo.maven.apache.org/maven2/org/apache/maven/reporting/maven-reporting/2.0/maven-reporting-2.0.pom
(504 B at 39 kB/s)
[INFO] Downloading from central: https://repo.maven.apache.org/maven2/doxia/doxia-sink-api/1.0-alpha-4/doxia-sink-api-1.0-alpha-4.pom
[INFO] Downloaded from central: https://repo.maven.apache.org/maven2/doxia/doxia-sink-api/1.0-alpha-4/doxia-sink-api-1.0-alpha-4.pom
(1.1 kB at 78 kB/s)
[INFO] Downloading from central: https://repo.maven.apache.org/maven2/org/apache/maven/maven-error-diagnostics/2.0/maven-error-diagnostics-2.0.pom
[INFO] Downloaded from central: https://repo.maven.apache.org/maven2/org/apache/maven/maven-error-diagnostics/2.0/maven-error-diagnostics-2.0.pom
(812 B at 58 kB/s)
[INFO] Downloading from central: https://repo.maven.apache.org/maven2/org/apache/maven/maven-plugin-registry/2.0/maven-plugin-registry-2.0.pom
[INFO] Downloaded from central: https://repo.maven.apache.org/maven2/org/apache/maven/maven-plugin-registry/2.0/maven-plugin-registry-2.0.pom
(1.3 kB at 99 kB/s)
[INFO] Downloading from central: https://repo.maven.apache.org/maven2/org/apache/maven/maven-plugin-descriptor/2.0/maven-plugin-descriptor-2.0.pom
[INFO] Downloaded from central: https://repo.maven.apache.org/maven2/org/apache/maven/maven-plugin-descriptor/2.0/maven-plugin-descriptor-2.0.pom
(1.5 kB at 104 kB/s)
[INFO] Downloading from central: https://repo.maven.apache.org/maven2/org/apache/maven/maven-monitor/2.0/maven-monitor-2.0.pom
[INFO] Downloaded from central: https://repo.maven.apache.org/maven2/org/apache/maven/maven-monitor/2.0/maven-monitor-2.0.pom
(400 B at 29 kB/s)
[INFO] Downloading from central: https://repo.maven.apache.org/maven2/org/apache/maven/doxia/doxia-logging-api/1.2/doxia-logging-api-1.2.jar
[INFO] Downloading from central: https://repo.maven.apache.org/maven2/org/codehaus/plexus/plexus-classworlds/1.2-alpha-9/plexus-classworlds-1.2-alpha-9.jar
[INFO] Downloading from central: https://repo.maven.apache.org/maven2/org/apache/rat/apache-rat-core/0.11/apache-rat-core-0.11.jar
[INFO] Downloading from central: https://repo.maven.apache.org/maven2/org/apache/maven/doxia/doxia-decoration-model/1.2/doxia-decoration-model-1.2.jar
[INFO] Downloading from central: https://repo.maven.apache.org/maven2/org/apache/maven/doxia/doxia-sink-api/1.2/doxia-sink-api-1.2.jar
[INFO] Downloaded from central: https://repo.maven.apache.org/maven2/org/apache/maven/doxia/doxia-logging-api/1.2/doxia-logging-api-1.2.jar
(11 kB at 186 kB/s)
[INFO] Downloading from central: https://repo.maven.apache.org/maven2/org/apache/maven/doxia/doxia-site-renderer/1.2/doxia-site-renderer-1.2.jar
[INFO] Downloaded from central: https://repo.maven.apache.org/maven2/org/apache/maven/doxia/doxia-site-renderer/1.2/doxia-site-renderer-1.2.jar
(52 kB at 1.4 MB/s)
[INFO] Downloading from central: https://repo.maven.apache.org/maven2/org/apache/maven/doxia/doxia-module-xhtml/1.2/doxia-module-xhtml-1.2.jar
[INFO] Downloaded from central: https://repo.maven.apache.org/maven2/org/apache/maven/doxia/doxia-sink-api/1.2/doxia-sink-api-1.2.jar
(11 kB at 274 kB/s)
[INFO] Downloading from central: https://repo.maven.apache.org/maven2/org/apache/maven/doxia/doxia-module-fml/1.2/doxia-module-fml-1.2.jar
[INFO] Downloaded from central: https://repo.maven.apache.org/maven2/org/codehaus/plexus/plexus-classworlds/1.2-alpha-9/plexus-classworlds-1.2-alpha-9.jar
(43 kB at 462 kB/s)
[INFO] Downloading from central: https://repo.maven.apache.org/maven2/org/apache/maven/shared/maven-plugin-testing-harness/1.1/maven-plugin-testing-harness-1.1.jar
[INFO] Downloaded from central: https://repo.maven.apache.org/maven2/org/apache/maven/doxia/doxia-decoration-model/1.2/doxia-decoration-model-1.2.jar
(60 kB at 1.1 MB/s)
[INFO] Downloading from central: https://repo.maven.apache.org/maven2/org/apache/maven/maven-core/2.0/maven-core-2.0.jar
[INFO] Downloaded from central: https://repo.maven.apache.org/maven2/org/apache/maven/doxia/doxia-module-xhtml/1.2/doxia-module-xhtml-1.2.jar
(15 kB at 296 kB/s)
[INFO] Downloading from central: https://repo.maven.apache.org/maven2/org/apache/maven/maven-plugin-parameter-documenter/2.0/maven-plugin-parameter-documenter-2.0.jar
[INFO] Downloaded from central: https://repo.maven.apache.org/maven2/org/apache/maven/doxia/doxia-module-fml/1.2/doxia-module-fml-1.2.jar
(38 kB at 642 kB/s)
[INFO] Downloading from central: https://repo.maven.apache.org/maven2/org/apache/maven/maven-error-diagnostics/2.0/maven-error-diagnostics-2.0.jar
[INFO] Downloaded from central: https://repo.maven.apache.org/maven2/org/apache/rat/apache-rat-core/0.11/apache-rat-core-0.11.jar
(118 kB at 1.1 MB/s)
[INFO] Downloading from central: https://repo.maven.apache.org/maven2/org/apache/maven/maven-plugin-descriptor/2.0/maven-plugin-descriptor-2.0.jar
[INFO] Downloaded from central: https://repo.maven.apache.org/maven2/org/apache/maven/shared/maven-plugin-testing-harness/1.1/maven-plugin-testing-harness-1.1.jar
(32 kB at 524 kB/s)
[INFO] Downloading from central: https://repo.maven.apache.org/maven2/org/apache/maven/maven-monitor/2.0/maven-monitor-2.0.jar
[INFO] Downloaded from central: https://repo.maven.apache.org/maven2/org/apache/maven/maven-plugin-parameter-documenter/2.0/maven-plugin-parameter-documenter-2.0.jar
(18 kB at 255 kB/s)
[INFO] Downloading from central: https://repo.maven.apache.org/maven2/org/codehaus/plexus/plexus-utils/3.0.8/plexus-utils-3.0.8.jar
[INFO] Downloaded from central: https://repo.maven.apache.org/maven2/org/apache/maven/maven-error-diagnostics/2.0/maven-error-diagnostics-2.0.jar
(10 kB at 139 kB/s)
[INFO] Downloaded from central: https://repo.maven.apache.org/maven2/org/apache/maven/maven-monitor/2.0/maven-monitor-2.0.jar
(7.6 kB at 100 kB/s)
[INFO] Downloaded from central: https://repo.maven.apache.org/maven2/org/apache/maven/maven-plugin-descriptor/2.0/maven-plugin-descriptor-2.0.jar
(33 kB at 425 kB/s)
[INFO] Downloaded from central: https://repo.maven.apache.org/maven2/org/apache/maven/maven-core/2.0/maven-core-2.0.jar
(136 kB at 1.6 MB/s)
[INFO] Downloaded from central: https://repo.maven.apache.org/maven2/org/codehaus/plexus/plexus-utils/3.0.8/plexus-utils-3.0.8.jar
(232 kB at 2.4 MB/s)
[INFO] 59 implicit excludes (use -debug for more details).
[INFO] Exclude: **/log4j.properties
[INFO] Exclude: **/README.md
[INFO] Exclude: **/git.properties
[INFO] Exclude: **/findbugsExcludeFile.xml
[INFO] Exclude: **/checkstyle-noframes-sorted.xsl
[INFO] Exclude: **/configure.ac
[INFO] Exclude: **/Makefile.am
[INFO] Exclude: conf/zoo_sample.cfg
[INFO] Exclude: conf/configuration.xsl
[INFO] Exclude: .travis.yml
[INFO] Exclude: excludeFindBugsFilter.xml
[INFO] Exclude: README_packaging.txt
[INFO] Exclude: src/main/resources/markdown/skin/*
[INFO] Exclude: src/main/resources/markdown/html/*
[INFO] Exclude: zookeeper-contrib/zookeeper-contrib-loggraph/src/main/resources/webapp/org/apache/zookeeper/graph/resources/*
[INFO] Exclude: zookeeper-contrib/zookeeper-contrib-zooinspector/TODO
[INFO] Exclude: zookeeper-contrib/zookeeper-contrib-zkperl/Changes
[INFO] Exclude: zookeeper-contrib/zookeeper-contrib-zkperl/MANIFEST
[INFO] Exclude: zookeeper-contrib/zookeeper-contrib-fatjar/src/main/resources/mainClasses
[INFO] Exclude: zookeeper-contrib/zookeeper-contrib-monitoring/JMX-RESOURCES
[INFO] Exclude: zookeeper-contrib/zookeeper-contrib-zooinspector/src/main/java/com/nitido/utils/toaster/Toaster.java
[INFO] Exclude: **/acinclude.m4
[INFO] Exclude: **/aminclude.am
[INFO] Exclude: zookeeper-client-c/src/hashtable/*
[INFO] Exclude: zookeeper-client-c/include/winconfig.h
[INFO] Exclude: zookeeper-client-c/tests/wrappers.opt
[INFO] Exclude: zookeeper-client-c/tests/quorum.cfg
[INFO] Exclude: zookeeper-client-c/tests/wrappers-mt.opt
[INFO] Exclude: **/c-doc.Doxyfile
[INFO] 35 resources included (use -debug for more details)
[INFO] Rat check: Summary of files. Unapproved: 0 unknown: 0 generated: 0 approved: 31 licence.
[INFO] 
[INFO] --- git-commit-id-plugin:2.2.5:revision (find-current-git-revision) @ parent ---
[INFO] ------------------------------------------------------------------------
[INFO] Reactor Summary for Apache ZooKeeper 3.6.0-SNAPSHOT:
[INFO] 
[INFO] Apache ZooKeeper ................................... FAILURE [  7.035 s]
[INFO] Apache ZooKeeper - Documentation ................... SKIPPED
[INFO] Apache ZooKeeper - Jute ............................ SKIPPED
[INFO] Apache ZooKeeper - Server .......................... SKIPPED
[INFO] Apache ZooKeeper - Metrics Providers ............... SKIPPED
[INFO] Apache ZooKeeper - Prometheus.io Metrics Provider .. SKIPPED
[INFO] Apache ZooKeeper - Client .......................... SKIPPED
[INFO] Apache ZooKeeper - Client - C ...................... SKIPPED
[INFO] Apache ZooKeeper - Recipes ......................... SKIPPED
[INFO] Apache ZooKeeper - Recipes - Election .............. SKIPPED
[INFO] Apache ZooKeeper - Recipes - Lock .................. SKIPPED
[INFO] Apache ZooKeeper - Recipes - Queue ................. SKIPPED
[INFO] Apache ZooKeeper - Assembly ........................ SKIPPED
[INFO] Apache ZooKeeper - Contrib ......................... SKIPPED
[INFO] Apache ZooKeeper - Contrib - Loggraph .............. SKIPPED
[INFO] Apache ZooKeeper - Contrib - Rest .................. SKIPPED
[INFO] Apache ZooKeeper - Contrib - ZooInspector .......... SKIPPED
[INFO] ------------------------------------------------------------------------
[INFO] BUILD FAILURE
[INFO] ------------------------------------------------------------------------
[INFO] Total time:  27.576 s
[INFO] Finished at: 2019-06-22T22:17:38Z
[INFO] ------------------------------------------------------------------------
Waiting for Jenkins to finish collecting data
[ERROR] Failed to execute goal pl.project13.maven:git-commit-id-plugin:2.2.5:revision (find-current-git-revision)
on project parent: Could not complete Mojo execution... Unable to find commits until some
tag: Walk failure. Missing commit 52dcf72b0a035116f83431e30c7acf7301982a28 -> [Help 1]
[ERROR] 
[ERROR] To see the full stack trace of the errors, re-run Maven with the -e switch.
[ERROR] Re-run Maven using the -X switch to enable full debug logging.
[ERROR] 
[ERROR] For more information about the errors and possible solutions, please read the following
articles:
[ERROR] [Help 1] http://cwiki.apache.org/confluence/display/MAVEN/MojoExecutionException
[JENKINS] Archiving <https://builds.apache.org/job/zookeeper-master-maven-jdk11/ws/zookeeper-server/pom.xml>
to org.apache.zookeeper/zookeeper/3.6.0-SNAPSHOT/zookeeper-3.6.0-SNAPSHOT.pom
[Fast Archiver] No prior successful build to compare, so performing full copy of artifacts
[JENKINS] Archiving <https://builds.apache.org/job/zookeeper-master-maven-jdk11/ws/zookeeper-contrib/zookeeper-contrib-loggraph/pom.xml>
to org.apache.zookeeper/zookeeper-contrib-loggraph/3.6.0-SNAPSHOT/zookeeper-contrib-loggraph-3.6.0-SNAPSHOT.pom
[Fast Archiver] No prior successful build to compare, so performing full copy of artifacts
[JENKINS] Archiving <https://builds.apache.org/job/zookeeper-master-maven-jdk11/ws/zookeeper-metrics-providers/pom.xml>
to org.apache.zookeeper/zookeeper-metrics-providers/3.6.0-SNAPSHOT/zookeeper-metrics-providers-3.6.0-SNAPSHOT.pom
[Fast Archiver] No prior successful build to compare, so performing full copy of artifacts
[JENKINS] Archiving <https://builds.apache.org/job/zookeeper-master-maven-jdk11/ws/zookeeper-metrics-providers/zookeeper-prometheus-metrics/pom.xml>
to org.apache.zookeeper/zookeeper-prometheus-metrics/3.6.0-SNAPSHOT/zookeeper-prometheus-metrics-3.6.0-SNAPSHOT.pom
[Fast Archiver] No prior successful build to compare, so performing full copy of artifacts
[JENKINS] Archiving <https://builds.apache.org/job/zookeeper-master-maven-jdk11/ws/zookeeper-recipes/zookeeper-recipes-election/pom.xml>
to org.apache.zookeeper/zookeeper-recipes-election/3.6.0-SNAPSHOT/zookeeper-recipes-election-3.6.0-SNAPSHOT.pom
[Fast Archiver] No prior successful build to compare, so performing full copy of artifacts
[JENKINS] Archiving <https://builds.apache.org/job/zookeeper-master-maven-jdk11/ws/pom.xml>
to org.apache.zookeeper/parent/3.6.0-SNAPSHOT/parent-3.6.0-SNAPSHOT.pom
[Fast Archiver] No prior successful build to compare, so performing full copy of artifacts
[JENKINS] Archiving <https://builds.apache.org/job/zookeeper-master-maven-jdk11/ws/zookeeper-recipes/zookeeper-recipes-lock/pom.xml>
to org.apache.zookeeper/zookeeper-recipes-lock/3.6.0-SNAPSHOT/zookeeper-recipes-lock-3.6.0-SNAPSHOT.pom
[Fast Archiver] No prior successful build to compare, so performing full copy of artifacts
[JENKINS] Archiving <https://builds.apache.org/job/zookeeper-master-maven-jdk11/ws/zookeeper-contrib/pom.xml>
to org.apache.zookeeper/zookeeper-contrib/3.6.0-SNAPSHOT/zookeeper-contrib-3.6.0-SNAPSHOT.pom
[Fast Archiver] No prior successful build to compare, so performing full copy of artifacts
[JENKINS] Archiving <https://builds.apache.org/job/zookeeper-master-maven-jdk11/ws/zookeeper-client/pom.xml>
to org.apache.zookeeper/zookeeper-client/3.6.0-SNAPSHOT/zookeeper-client-3.6.0-SNAPSHOT.pom
[Fast Archiver] No prior successful build to compare, so performing full copy of artifacts
[JENKINS] Archiving <https://builds.apache.org/job/zookeeper-master-maven-jdk11/ws/zookeeper-jute/pom.xml>
to org.apache.zookeeper/zookeeper-jute/3.6.0-SNAPSHOT/zookeeper-jute-3.6.0-SNAPSHOT.pom
[Fast Archiver] No prior successful build to compare, so performing full copy of artifacts
[JENKINS] Archiving <https://builds.apache.org/job/zookeeper-master-maven-jdk11/ws/zookeeper-recipes/zookeeper-recipes-queue/pom.xml>
to org.apache.zookeeper/zookeeper-recipes-queue/3.6.0-SNAPSHOT/zookeeper-recipes-queue-3.6.0-SNAPSHOT.pom
[Fast Archiver] No prior successful build to compare, so performing full copy of artifacts
[JENKINS] Archiving <https://builds.apache.org/job/zookeeper-master-maven-jdk11/ws/zookeeper-docs/pom.xml>
to org.apache.zookeeper/zookeeper-docs/3.6.0-SNAPSHOT/zookeeper-docs-3.6.0-SNAPSHOT.pom
[Fast Archiver] No prior successful build to compare, so performing full copy of artifacts
[JENKINS] Archiving <https://builds.apache.org/job/zookeeper-master-maven-jdk11/ws/zookeeper-recipes/pom.xml>
to org.apache.zookeeper/zookeeper-recipes/3.6.0-SNAPSHOT/zookeeper-recipes-3.6.0-SNAPSHOT.pom
[Fast Archiver] No prior successful build to compare, so performing full copy of artifacts
[JENKINS] Archiving <https://builds.apache.org/job/zookeeper-master-maven-jdk11/ws/zookeeper-client/zookeeper-client-c/pom.xml>
to org.apache.zookeeper/zookeeper-client-c/3.6.0-SNAPSHOT/zookeeper-client-c-3.6.0-SNAPSHOT.pom
[Fast Archiver] No prior successful build to compare, so performing full copy of artifacts
[JENKINS] Archiving <https://builds.apache.org/job/zookeeper-master-maven-jdk11/ws/zookeeper-contrib/zookeeper-contrib-rest/pom.xml>
to org.apache.zookeeper/zookeeper-contrib-rest/3.6.0-SNAPSHOT/zookeeper-contrib-rest-3.6.0-SNAPSHOT.pom
[Fast Archiver] No prior successful build to compare, so performing full copy of artifacts
[JENKINS] Archiving <https://builds.apache.org/job/zookeeper-master-maven-jdk11/ws/zookeeper-assembly/pom.xml>
to org.apache.zookeeper/zookeeper-assembly/3.6.0-SNAPSHOT/zookeeper-assembly-3.6.0-SNAPSHOT.pom
[Fast Archiver] No prior successful build to compare, so performing full copy of artifacts
[JENKINS] Archiving <https://builds.apache.org/job/zookeeper-master-maven-jdk11/ws/zookeeper-contrib/zookeeper-contrib-zooinspector/pom.xml>
to org.apache.zookeeper/zookeeper-contrib-zooinspector/3.6.0-SNAPSHOT/zookeeper-contrib-zooinspector-3.6.0-SNAPSHOT.pom
[Fast Archiver] No prior successful build to compare, so performing full copy of artifacts
channel stopped
[SpotBugs] Skipping execution of recorder since overall result is 'FAILURE'

Mime
View raw message