zookeeper-dev mailing list archives

Site index · List index
Message view « Date » · « Thread »
Top « Date » · « Thread »
From Apache Jenkins Server <jenk...@builds.apache.org>
Subject ZooKeeper-trunk-windows-cmake - Build # 3426 - Failure
Date Thu, 20 Jun 2019 19:00:21 GMT
See https://builds.apache.org/job/ZooKeeper-trunk-windows-cmake/3426/

###################################################################################
########################## LAST 60 LINES OF THE CONSOLE ###########################
[...truncated 8.21 KB...]
[ivy:retrieve] 	found com.fasterxml.jackson.core#jackson-databind;2.9.9 in default
[ivy:retrieve] 	found com.fasterxml.jackson.core#jackson-annotations;2.9.0 in default
[ivy:retrieve] 	found com.fasterxml.jackson.core#jackson-core;2.9.9 in default
[ivy:retrieve] 	found org.slf4j#slf4j-api;1.7.25 in default
[ivy:retrieve] 	found org.slf4j#slf4j-log4j12;1.7.25 in default
[ivy:retrieve] 	found commons-cli#commons-cli;1.2 in default
[ivy:retrieve] 	found com.github.spotbugs#spotbugs-annotations;3.1.9 in default
[ivy:retrieve] 	found com.google.code.findbugs#jsr305;3.0.2 in default
[ivy:retrieve] 	found log4j#log4j;1.2.17 in default
[ivy:retrieve] 	found org.apache.yetus#audience-annotations;0.5.0 in default
[ivy:retrieve] 	found io.netty#netty-all;4.1.36.Final in default
[ivy:retrieve] 	found com.googlecode.json-simple#json-simple;1.1.1 in default
[ivy:retrieve] 	found commons-lang#commons-lang;2.6 in default
[ivy:retrieve] 	found org.xerial.snappy#snappy-java;1.1.7 in default
[ivy:retrieve] 	found io.dropwizard.metrics#metrics-core;3.2.5 in default

BUILD FAILED
f:\jenkins\jenkins-slave\workspace\ZooKeeper-trunk-windows-cmake\build.xml:431: impossible
to resolve dependencies:
	java.io.IOException: There is not enough space on the disk
	at java.base/java.io.FileOutputStream.writeBytes(Native Method)
	at java.base/java.io.FileOutputStream.write(FileOutputStream.java:332)
	at java.base/sun.nio.cs.StreamEncoder.writeBytes(StreamEncoder.java:233)
	at java.base/sun.nio.cs.StreamEncoder.implFlushBuffer(StreamEncoder.java:312)
	at java.base/sun.nio.cs.StreamEncoder.implFlush(StreamEncoder.java:316)
	at java.base/sun.nio.cs.StreamEncoder.flush(StreamEncoder.java:153)
	at java.base/java.io.OutputStreamWriter.flush(OutputStreamWriter.java:254)
	at java.base/java.io.BufferedWriter.flush(BufferedWriter.java:257)
	at java.base/java.util.Properties.store0(Properties.java:885)
	at java.base/java.util.Properties.store(Properties.java:859)
	at org.apache.ivy.core.resolve.ResolveEngine.resolve(ResolveEngine.java:342)
	at org.apache.ivy.core.resolve.ResolveEngine.resolve(ResolveEngine.java:208)
	at org.apache.ivy.Ivy.resolve(Ivy.java:507)
	at org.apache.ivy.ant.IvyResolve.doExecute(IvyResolve.java:328)
	at org.apache.ivy.ant.IvyTask.execute(IvyTask.java:259)
	at org.apache.ivy.ant.IvyPostResolveTask.ensureResolved(IvyPostResolveTask.java:229)
	at org.apache.ivy.ant.IvyPostResolveTask.prepareAndCheck(IvyPostResolveTask.java:183)
	at org.apache.ivy.ant.IvyRetrieve.doExecute(IvyRetrieve.java:92)
	at org.apache.ivy.ant.IvyTask.execute(IvyTask.java:259)
	at org.apache.tools.ant.UnknownElement.execute(UnknownElement.java:293)
	at jdk.internal.reflect.GeneratedMethodAccessor6.invoke(Unknown Source)
	at java.base/jdk.internal.reflect.DelegatingMethodAccessorImpl.invoke(DelegatingMethodAccessorImpl.java:43)
	at java.base/java.lang.reflect.Method.invoke(Method.java:564)
	at org.apache.tools.ant.dispatch.DispatchUtils.execute(DispatchUtils.java:106)
	at org.apache.tools.ant.Task.perform(Task.java:348)
	at org.apache.tools.ant.Target.execute(Target.java:435)
	at org.apache.tools.ant.Target.performTasks(Target.java:456)
	at org.apache.tools.ant.Project.executeSortedTargets(Project.java:1405)
	at org.apache.tools.ant.Project.executeTarget(Project.java:1376)
	at org.apache.tools.ant.helper.DefaultExecutor.executeTargets(DefaultExecutor.java:41)
	at org.apache.tools.ant.Project.executeTargets(Project.java:1260)
	at org.apache.tools.ant.Main.runBuild(Main.java:854)
	at org.apache.tools.ant.Main.startAnt(Main.java:236)
	at org.apache.tools.ant.launch.Launcher.run(Launcher.java:285)
	at org.apache.tools.ant.launch.Launcher.main(Launcher.java:112)

Total time: 15 seconds
Build step 'Invoke Ant' marked build as failure
Email was triggered for: Failure - Any
Sending email for trigger: Failure - Any



###################################################################################
############################## FAILED TESTS (if any) ##############################
No tests ran.
Mime
  • Unnamed multipart/mixed (inline, None, 0 bytes)
View raw message