zookeeper-dev mailing list archives

Site index · List index
Message view « Date » · « Thread »
Top « Date » · « Thread »
From Apache Jenkins Server <jenk...@builds.apache.org>
Subject ZooKeeper_branch34_openjdk8 - Build # 345 - Failure
Date Mon, 03 Jun 2019 11:41:06 GMT
See https://builds.apache.org/job/ZooKeeper_branch34_openjdk8/345/

###################################################################################
########################## LAST 60 LINES OF THE CONSOLE ###########################
[...truncated 44.22 KB...]
    [junit] Tests run: 1, Failures: 0, Errors: 0, Skipped: 0, Time elapsed: 0.536 sec
    [junit] Running org.apache.zookeeper.test.SaslAuthFailTest
    [junit] Tests run: 1, Failures: 0, Errors: 0, Skipped: 0, Time elapsed: 0.653 sec
    [junit] Running org.apache.zookeeper.test.SaslAuthMissingClientConfigTest
    [junit] Tests run: 1, Failures: 0, Errors: 0, Skipped: 0, Time elapsed: 0.559 sec
    [junit] Running org.apache.zookeeper.test.SaslClientTest
    [junit] Tests run: 1, Failures: 0, Errors: 0, Skipped: 0, Time elapsed: 0.082 sec
    [junit] Running org.apache.zookeeper.test.SessionInvalidationTest
    [junit] Tests run: 1, Failures: 0, Errors: 0, Skipped: 0, Time elapsed: 0.692 sec
    [junit] Running org.apache.zookeeper.test.SessionTest
    [junit] Tests run: 5, Failures: 0, Errors: 0, Skipped: 0, Time elapsed: 11.562 sec
    [junit] Running org.apache.zookeeper.test.SessionTimeoutTest
    [junit] Tests run: 4, Failures: 0, Errors: 0, Skipped: 0, Time elapsed: 0.962 sec
    [junit] Running org.apache.zookeeper.test.StandaloneTest
    [junit] Tests run: 1, Failures: 0, Errors: 0, Skipped: 0, Time elapsed: 0.939 sec
    [junit] Running org.apache.zookeeper.test.StatTest
    [junit] Tests run: 4, Failures: 0, Errors: 0, Skipped: 0, Time elapsed: 0.906 sec
    [junit] Running org.apache.zookeeper.test.StaticHostProviderTest
    [junit] Tests run: 13, Failures: 0, Errors: 0, Skipped: 0, Time elapsed: 1.757 sec
    [junit] Running org.apache.zookeeper.test.SyncCallTest
    [junit] Tests run: 1, Failures: 0, Errors: 0, Skipped: 0, Time elapsed: 0.615 sec
    [junit] Running org.apache.zookeeper.test.TruncateTest
    [junit] Tests run: 3, Failures: 0, Errors: 0, Skipped: 0, Time elapsed: 9.501 sec
    [junit] Running org.apache.zookeeper.test.UpgradeTest
    [junit] Tests run: 1, Failures: 0, Errors: 0, Skipped: 0, Time elapsed: 0.915 sec
    [junit] Running org.apache.zookeeper.test.WatchedEventTest
    [junit] Tests run: 4, Failures: 0, Errors: 0, Skipped: 0, Time elapsed: 0.094 sec
    [junit] Running org.apache.zookeeper.test.WatcherFuncTest
    [junit] Tests run: 6, Failures: 0, Errors: 0, Skipped: 0, Time elapsed: 1.324 sec
    [junit] Running org.apache.zookeeper.test.WatcherTest
    [junit] Tests run: 7, Failures: 0, Errors: 1, Skipped: 0, Time elapsed: 37.047 sec
    [junit] Test org.apache.zookeeper.test.WatcherTest FAILED
    [junit] Running org.apache.zookeeper.test.ZkDatabaseCorruptionTest
    [junit] Tests run: 1, Failures: 0, Errors: 0, Skipped: 0, Time elapsed: 10.485 sec
    [junit] Running org.apache.zookeeper.test.ZooKeeperQuotaTest
    [junit] Tests run: 1, Failures: 0, Errors: 0, Skipped: 0, Time elapsed: 0.764 sec
    [junit] Running org.apache.jute.BinaryInputArchiveTest
    [junit] Tests run: 1, Failures: 0, Errors: 0, Skipped: 0, Time elapsed: 0.075 sec

fail.build.on.test.failure:

BUILD FAILED
/home/jenkins/jenkins-slave/workspace/ZooKeeper_branch34_openjdk8/build.xml:1425: The following
error occurred while executing this line:
/home/jenkins/jenkins-slave/workspace/ZooKeeper_branch34_openjdk8/build.xml:1428: Tests failed!

Total time: 44 minutes 38 seconds
Build step 'Invoke Ant' marked build as failure
Archiving artifacts
Setting OPENJDK_8_ON_UBUNTU_ONLY__HOME=/usr/lib/jvm/java-8-openjdk-amd64/
Recording test results
Setting OPENJDK_8_ON_UBUNTU_ONLY__HOME=/usr/lib/jvm/java-8-openjdk-amd64/
Setting OPENJDK_8_ON_UBUNTU_ONLY__HOME=/usr/lib/jvm/java-8-openjdk-amd64/
Setting OPENJDK_8_ON_UBUNTU_ONLY__HOME=/usr/lib/jvm/java-8-openjdk-amd64/
Email was triggered for: Failure - Any
Sending email for trigger: Failure - Any
Setting OPENJDK_8_ON_UBUNTU_ONLY__HOME=/usr/lib/jvm/java-8-openjdk-amd64/
Setting OPENJDK_8_ON_UBUNTU_ONLY__HOME=/usr/lib/jvm/java-8-openjdk-amd64/
Setting OPENJDK_8_ON_UBUNTU_ONLY__HOME=/usr/lib/jvm/java-8-openjdk-amd64/
Setting OPENJDK_8_ON_UBUNTU_ONLY__HOME=/usr/lib/jvm/java-8-openjdk-amd64/



###################################################################################
############################## FAILED TESTS (if any) ##############################
1 tests failed.
FAILED:  org.apache.zookeeper.test.WatcherTest.testWatcherAutoResetDisabledWithLocal

Error Message:
KeeperErrorCode = ConnectionLoss for /watchtest/child

Stack Trace:
org.apache.zookeeper.KeeperException$ConnectionLossException: KeeperErrorCode = ConnectionLoss
for /watchtest/child
	at org.apache.zookeeper.KeeperException.create(KeeperException.java:102)
	at org.apache.zookeeper.KeeperException.create(KeeperException.java:54)
	at org.apache.zookeeper.ZooKeeper.delete(ZooKeeper.java:890)
	at org.apache.zookeeper.test.WatcherTest.testWatcherAutoReset(WatcherTest.java:390)
	at org.apache.zookeeper.test.WatcherTest.testWatcherAutoResetWithLocal(WatcherTest.java:255)
	at org.apache.zookeeper.test.WatcherTest.testWatcherAutoResetDisabledWithLocal(WatcherTest.java:268)
	at org.apache.zookeeper.JUnit4ZKTestRunner$LoggedInvokeMethod.evaluate(JUnit4ZKTestRunner.java:55)
Mime
  • Unnamed multipart/mixed (inline, None, 0 bytes)
View raw message