zookeeper-dev mailing list archives

Site index · List index
Message view « Date » · « Thread »
Top « Date » · « Thread »
From Apache Jenkins Server <jenk...@builds.apache.org>
Subject Build failed in Jenkins: zookeeper-master-maven-jdk11 #3
Date Sun, 23 Jun 2019 11:35:46 GMT
See <https://builds.apache.org/job/zookeeper-master-maven-jdk11/3/display/redirect>

------------------------------------------
[...truncated 13.37 KB...]
[INFO] Downloading from central: https://repo.maven.apache.org/maven2/org/apache/maven/doxia/doxia-logging-api/1.2/doxia-logging-api-1.2.jar
[INFO] Downloading from central: https://repo.maven.apache.org/maven2/org/codehaus/plexus/plexus-classworlds/1.2-alpha-9/plexus-classworlds-1.2-alpha-9.jar
[INFO] Downloading from central: https://repo.maven.apache.org/maven2/org/apache/rat/apache-rat-core/0.11/apache-rat-core-0.11.jar
[INFO] Downloading from central: https://repo.maven.apache.org/maven2/org/apache/maven/doxia/doxia-decoration-model/1.2/doxia-decoration-model-1.2.jar
[INFO] Downloading from central: https://repo.maven.apache.org/maven2/org/apache/maven/doxia/doxia-sink-api/1.2/doxia-sink-api-1.2.jar
[INFO] Downloaded from central: https://repo.maven.apache.org/maven2/org/apache/maven/doxia/doxia-logging-api/1.2/doxia-logging-api-1.2.jar
(11 kB at 630 kB/s)
[INFO] Downloading from central: https://repo.maven.apache.org/maven2/org/apache/maven/doxia/doxia-site-renderer/1.2/doxia-site-renderer-1.2.jar
[INFO] Downloaded from central: https://repo.maven.apache.org/maven2/org/apache/maven/doxia/doxia-site-renderer/1.2/doxia-site-renderer-1.2.jar
(52 kB at 1.6 MB/s)
[INFO] Downloading from central: https://repo.maven.apache.org/maven2/org/apache/maven/doxia/doxia-module-xhtml/1.2/doxia-module-xhtml-1.2.jar
[INFO] Downloaded from central: https://repo.maven.apache.org/maven2/org/apache/maven/doxia/doxia-sink-api/1.2/doxia-sink-api-1.2.jar
(11 kB at 261 kB/s)
[INFO] Downloading from central: https://repo.maven.apache.org/maven2/org/apache/maven/doxia/doxia-module-fml/1.2/doxia-module-fml-1.2.jar
[INFO] Downloaded from central: https://repo.maven.apache.org/maven2/org/apache/maven/doxia/doxia-module-xhtml/1.2/doxia-module-xhtml-1.2.jar
(15 kB at 321 kB/s)
[INFO] Downloading from central: https://repo.maven.apache.org/maven2/org/apache/maven/shared/maven-plugin-testing-harness/1.1/maven-plugin-testing-harness-1.1.jar
[INFO] Downloaded from central: https://repo.maven.apache.org/maven2/org/apache/maven/doxia/doxia-decoration-model/1.2/doxia-decoration-model-1.2.jar
(60 kB at 1.1 MB/s)
[INFO] Downloading from central: https://repo.maven.apache.org/maven2/org/codehaus/plexus/plexus-utils/3.0.8/plexus-utils-3.0.8.jar
[INFO] Downloaded from central: https://repo.maven.apache.org/maven2/org/codehaus/plexus/plexus-classworlds/1.2-alpha-9/plexus-classworlds-1.2-alpha-9.jar
(43 kB at 746 kB/s)
[INFO] Downloaded from central: https://repo.maven.apache.org/maven2/org/apache/rat/apache-rat-core/0.11/apache-rat-core-0.11.jar
(118 kB at 1.9 MB/s)
[INFO] Downloaded from central: https://repo.maven.apache.org/maven2/org/apache/maven/doxia/doxia-module-fml/1.2/doxia-module-fml-1.2.jar
(38 kB at 631 kB/s)
[INFO] Downloaded from central: https://repo.maven.apache.org/maven2/org/apache/maven/shared/maven-plugin-testing-harness/1.1/maven-plugin-testing-harness-1.1.jar
(32 kB at 508 kB/s)
[INFO] Downloaded from central: https://repo.maven.apache.org/maven2/org/codehaus/plexus/plexus-utils/3.0.8/plexus-utils-3.0.8.jar
(232 kB at 2.9 MB/s)
[INFO] 59 implicit excludes (use -debug for more details).
[INFO] Exclude: **/log4j.properties
[INFO] Exclude: **/README.md
[INFO] Exclude: **/git.properties
[INFO] Exclude: **/findbugsExcludeFile.xml
[INFO] Exclude: **/checkstyle-noframes-sorted.xsl
[INFO] Exclude: **/configure.ac
[INFO] Exclude: **/Makefile.am
[INFO] Exclude: conf/zoo_sample.cfg
[INFO] Exclude: conf/configuration.xsl
[INFO] Exclude: .travis.yml
[INFO] Exclude: excludeFindBugsFilter.xml
[INFO] Exclude: README_packaging.txt
[INFO] Exclude: src/main/resources/markdown/skin/*
[INFO] Exclude: src/main/resources/markdown/html/*
[INFO] Exclude: zookeeper-contrib/zookeeper-contrib-loggraph/src/main/resources/webapp/org/apache/zookeeper/graph/resources/*
[INFO] Exclude: zookeeper-contrib/zookeeper-contrib-zooinspector/TODO
[INFO] Exclude: zookeeper-contrib/zookeeper-contrib-zkperl/Changes
[INFO] Exclude: zookeeper-contrib/zookeeper-contrib-zkperl/MANIFEST
[INFO] Exclude: zookeeper-contrib/zookeeper-contrib-fatjar/src/main/resources/mainClasses
[INFO] Exclude: zookeeper-contrib/zookeeper-contrib-monitoring/JMX-RESOURCES
[INFO] Exclude: zookeeper-contrib/zookeeper-contrib-zooinspector/src/main/java/com/nitido/utils/toaster/Toaster.java
[INFO] Exclude: **/acinclude.m4
[INFO] Exclude: **/aminclude.am
[INFO] Exclude: zookeeper-client-c/src/hashtable/*
[INFO] Exclude: zookeeper-client-c/include/winconfig.h
[INFO] Exclude: zookeeper-client-c/tests/wrappers.opt
[INFO] Exclude: zookeeper-client-c/tests/quorum.cfg
[INFO] Exclude: zookeeper-client-c/tests/wrappers-mt.opt
[INFO] Exclude: **/c-doc.Doxyfile
[INFO] 35 resources included (use -debug for more details)
[INFO] Rat check: Summary of files. Unapproved: 0 unknown: 0 generated: 0 approved: 31 licence.
[INFO] 
[INFO] --- git-commit-id-plugin:2.2.5:revision (find-current-git-revision) @ parent ---
[INFO] 
[INFO] --- maven-antrun-plugin:1.8:run (default) @ parent ---
[INFO] Executing tasks

main:
[INFO] Executed tasks
[INFO] 
[INFO] --- maven-remote-resources-plugin:1.5:process (process-resource-bundles) @ parent ---
[INFO] 
[INFO] --- maven-site-plugin:3.5.1:attach-descriptor (attach-descriptor) @ parent ---
[WARNING] Attempt to (de-)serialize anonymous class hudson.maven.reporters.BuildInfoRecorder$1;
see: https://jenkins.io/redirect/serialization-of-anonymous-classes/
[INFO] 
[INFO] --- maven-jar-plugin:3.1.0:test-jar (Jar Tests Package) @ parent ---
[INFO] Skipping packaging of the test-jar
[INFO] 
[INFO] >>> maven-source-plugin:3.0.1:jar (attach-sources) > generate-sources @
parent >>>
[INFO] 
[INFO] --- git-commit-id-plugin:2.2.5:revision (find-current-git-revision) @ parent ---
[INFO] 
[INFO] --- maven-antrun-plugin:1.8:run (default) @ parent ---
[INFO] Executing tasks

main:
[INFO] Executed tasks
[WARNING] Failed to getClass for org.apache.maven.plugins.source.SourceJarMojo
[INFO] 
[INFO] <<< maven-source-plugin:3.0.1:jar (attach-sources) < generate-sources @
parent <<<
[INFO] 
[INFO] 
[INFO] --- maven-source-plugin:3.0.1:jar (attach-sources) @ parent ---
[INFO] 
[INFO] --- maven-javadoc-plugin:3.0.1:jar (attach-javadocs) @ parent ---
[INFO] Not executing Javadoc as the project is not a Java classpath-capable package
[INFO] 
[INFO] --- checksum-maven-plugin:1.8:artifacts (default) @ parent ---
[INFO] 
[INFO] >>> spotbugs-maven-plugin:3.1.9:check (default-cli) > :spotbugs @ parent
>>>
[INFO] 
[INFO] --- spotbugs-maven-plugin:3.1.9:spotbugs (spotbugs) @ parent ---
WARNING: An illegal reflective access operation has occurred
WARNING: Illegal reflective access by org.codehaus.groovy.vmplugin.v7.Java7$1 (file:/home/jenkins/jenkins-slave/maven-repositories/1/org/codehaus/groovy/groovy/2.5.4/groovy-2.5.4.jar)
to constructor java.lang.invoke.MethodHandles$Lookup(java.lang.Class,int)
WARNING: Please consider reporting this to the maintainers of org.codehaus.groovy.vmplugin.v7.Java7$1
WARNING: Use --illegal-access=warn to enable warnings of further illegal reflective access
operations
WARNING: All illegal access operations will be denied in a future release
[INFO] 
[INFO] <<< spotbugs-maven-plugin:3.1.9:check (default-cli) < :spotbugs @ parent
<<<
[INFO] 
[INFO] 
[INFO] --- spotbugs-maven-plugin:3.1.9:check (default-cli) @ parent ---
[INFO] 
[INFO] --- maven-checkstyle-plugin:3.0.0:check (default-cli) @ parent ---
[INFO] Downloading from central: https://repo.maven.apache.org/maven2/com/puppycrawl/tools/checkstyle/8.17/checkstyle-8.17.pom
[INFO] Downloaded from central: https://repo.maven.apache.org/maven2/com/puppycrawl/tools/checkstyle/8.17/checkstyle-8.17.pom
(125 kB at 3.5 MB/s)
[INFO] Downloading from central: https://repo.maven.apache.org/maven2/info/picocli/picocli/3.9.0/picocli-3.9.0.pom
[INFO] Downloaded from central: https://repo.maven.apache.org/maven2/info/picocli/picocli/3.9.0/picocli-3.9.0.pom
(1.4 kB at 96 kB/s)
[INFO] Downloading from central: https://repo.maven.apache.org/maven2/org/antlr/antlr4-runtime/4.7.2/antlr4-runtime-4.7.2.pom
[INFO] Downloaded from central: https://repo.maven.apache.org/maven2/org/antlr/antlr4-runtime/4.7.2/antlr4-runtime-4.7.2.pom
(3.6 kB at 258 kB/s)
[INFO] Downloading from central: https://repo.maven.apache.org/maven2/org/antlr/antlr4-master/4.7.2/antlr4-master-4.7.2.pom
[INFO] Downloaded from central: https://repo.maven.apache.org/maven2/org/antlr/antlr4-master/4.7.2/antlr4-master-4.7.2.pom
(4.4 kB at 315 kB/s)
[INFO] Downloading from central: https://repo.maven.apache.org/maven2/com/google/guava/guava/27.0.1-jre/guava-27.0.1-jre.pom
[INFO] Downloaded from central: https://repo.maven.apache.org/maven2/com/google/guava/guava/27.0.1-jre/guava-27.0.1-jre.pom
(8.3 kB at 637 kB/s)
[INFO] Downloading from central: https://repo.maven.apache.org/maven2/com/google/guava/guava-parent/27.0.1-jre/guava-parent-27.0.1-jre.pom
[INFO] Downloaded from central: https://repo.maven.apache.org/maven2/com/google/guava/guava-parent/27.0.1-jre/guava-parent-27.0.1-jre.pom
(10 kB at 743 kB/s)
[INFO] Downloading from central: https://repo.maven.apache.org/maven2/com/google/guava/failureaccess/1.0.1/failureaccess-1.0.1.pom
[INFO] Downloaded from central: https://repo.maven.apache.org/maven2/com/google/guava/failureaccess/1.0.1/failureaccess-1.0.1.pom
(2.4 kB at 201 kB/s)
[INFO] Downloading from central: https://repo.maven.apache.org/maven2/com/google/guava/listenablefuture/9999.0-empty-to-avoid-conflict-with-guava/listenablefuture-9999.0-empty-to-avoid-conflict-with-guava.pom
[INFO] Downloaded from central: https://repo.maven.apache.org/maven2/com/google/guava/listenablefuture/9999.0-empty-to-avoid-conflict-with-guava/listenablefuture-9999.0-empty-to-avoid-conflict-with-guava.pom
(2.3 kB at 190 kB/s)
[INFO] Downloading from central: https://repo.maven.apache.org/maven2/net/sf/saxon/Saxon-HE/9.9.0-2/Saxon-HE-9.9.0-2.pom
[INFO] Downloaded from central: https://repo.maven.apache.org/maven2/net/sf/saxon/Saxon-HE/9.9.0-2/Saxon-HE-9.9.0-2.pom
(3.5 kB at 218 kB/s)
[INFO] Downloading from central: https://repo.maven.apache.org/maven2/com/puppycrawl/tools/checkstyle/8.17/checkstyle-8.17.jar
[INFO] Downloading from central: https://repo.maven.apache.org/maven2/info/picocli/picocli/3.9.0/picocli-3.9.0.jar
[INFO] Downloading from central: https://repo.maven.apache.org/maven2/org/antlr/antlr4-runtime/4.7.2/antlr4-runtime-4.7.2.jar
[INFO] Downloading from central: https://repo.maven.apache.org/maven2/com/google/guava/guava/27.0.1-jre/guava-27.0.1-jre.jar
[INFO] Downloading from central: https://repo.maven.apache.org/maven2/com/google/guava/failureaccess/1.0.1/failureaccess-1.0.1.jar
[INFO] Downloaded from central: https://repo.maven.apache.org/maven2/com/google/guava/failureaccess/1.0.1/failureaccess-1.0.1.jar
(4.6 kB at 308 kB/s)
[INFO] Downloading from central: https://repo.maven.apache.org/maven2/com/google/guava/listenablefuture/9999.0-empty-to-avoid-conflict-with-guava/listenablefuture-9999.0-empty-to-avoid-conflict-with-guava.jar
[INFO] Downloaded from central: https://repo.maven.apache.org/maven2/com/google/guava/listenablefuture/9999.0-empty-to-avoid-conflict-with-guava/listenablefuture-9999.0-empty-to-avoid-conflict-with-guava.jar
(2.2 kB at 79 kB/s)
[INFO] Downloading from central: https://repo.maven.apache.org/maven2/net/sf/saxon/Saxon-HE/9.9.0-2/Saxon-HE-9.9.0-2.jar
[INFO] Downloaded from central: https://repo.maven.apache.org/maven2/info/picocli/picocli/3.9.0/picocli-3.9.0.jar
(261 kB at 7.4 MB/s)
[INFO] Downloaded from central: https://repo.maven.apache.org/maven2/org/antlr/antlr4-runtime/4.7.2/antlr4-runtime-4.7.2.jar
(338 kB at 9.1 MB/s)
[INFO] Downloaded from central: https://repo.maven.apache.org/maven2/com/puppycrawl/tools/checkstyle/8.17/checkstyle-8.17.jar
(1.3 MB at 11 MB/s)
[INFO] Downloaded from central: https://repo.maven.apache.org/maven2/com/google/guava/guava/27.0.1-jre/guava-27.0.1-jre.jar
(2.7 MB at 17 MB/s)
[INFO] Downloaded from central: https://repo.maven.apache.org/maven2/net/sf/saxon/Saxon-HE/9.9.0-2/Saxon-HE-9.9.0-2.jar
(5.5 MB at 16 MB/s)
[INFO] Starting audit...
Audit done.
[INFO] 
[INFO] ----------------< org.apache.zookeeper:zookeeper-docs >-----------------
[INFO] Building Apache ZooKeeper - Documentation 3.6.0-SNAPSHOT          [2/17]
[INFO] --------------------------------[ jar ]---------------------------------
[INFO] 
[INFO] --- apache-rat-plugin:0.11:check (default-cli) @ zookeeper-docs ---
[INFO] 51 implicit excludes (use -debug for more details).
[INFO] Exclude: **/log4j.properties
[INFO] Exclude: **/README.md
[INFO] Exclude: **/git.properties
[INFO] Exclude: **/findbugsExcludeFile.xml
[INFO] Exclude: **/checkstyle-noframes-sorted.xsl
[INFO] Exclude: **/configure.ac
[INFO] Exclude: **/Makefile.am
[INFO] Exclude: conf/zoo_sample.cfg
[INFO] Exclude: conf/configuration.xsl
[INFO] Exclude: .travis.yml
[INFO] Exclude: excludeFindBugsFilter.xml
[INFO] Exclude: README_packaging.txt
[INFO] Exclude: src/main/resources/markdown/skin/*
[INFO] Exclude: src/main/resources/markdown/html/*
[INFO] Exclude: zookeeper-contrib/zookeeper-contrib-loggraph/src/main/resources/webapp/org/apache/zookeeper/graph/resources/*
[INFO] Exclude: zookeeper-contrib/zookeeper-contrib-zooinspector/TODO
[INFO] Exclude: zookeeper-contrib/zookeeper-contrib-zkperl/Changes
[INFO] Exclude: zookeeper-contrib/zookeeper-contrib-zkperl/MANIFEST
[INFO] Exclude: zookeeper-contrib/zookeeper-contrib-fatjar/src/main/resources/mainClasses
[INFO] Exclude: zookeeper-contrib/zookeeper-contrib-monitoring/JMX-RESOURCES
[INFO] Exclude: zookeeper-contrib/zookeeper-contrib-zooinspector/src/main/java/com/nitido/utils/toaster/Toaster.java
[INFO] Exclude: **/acinclude.m4
[INFO] Exclude: **/aminclude.am
[INFO] Exclude: zookeeper-client-c/src/hashtable/*
[INFO] Exclude: zookeeper-client-c/include/winconfig.h
[INFO] Exclude: zookeeper-client-c/tests/wrappers.opt
[INFO] Exclude: zookeeper-client-c/tests/quorum.cfg
[INFO] Exclude: zookeeper-client-c/tests/wrappers-mt.opt
[INFO] Exclude: **/c-doc.Doxyfile
[INFO] 33 resources included (use -debug for more details)
[INFO] Rat check: Summary of files. Unapproved: 1 unknown: 1 generated: 0 approved: 19 licence.
[INFO] ------------------------------------------------------------------------
[INFO] Reactor Summary for Apache ZooKeeper 3.6.0-SNAPSHOT:
[INFO] 
[INFO] Apache ZooKeeper ................................... SUCCESS [ 17.871 s]
[INFO] Apache ZooKeeper - Documentation ................... FAILURE [  0.860 s]
[INFO] Apache ZooKeeper - Jute ............................ SKIPPED
[INFO] Apache ZooKeeper - Server .......................... SKIPPED
[INFO] Apache ZooKeeper - Metrics Providers ............... SKIPPED
[INFO] Apache ZooKeeper - Prometheus.io Metrics Provider .. SKIPPED
[INFO] Apache ZooKeeper - Client .......................... SKIPPED
[INFO] Apache ZooKeeper - Client - C ...................... SKIPPED
[INFO] Apache ZooKeeper - Recipes ......................... SKIPPED
[INFO] Apache ZooKeeper - Recipes - Election .............. SKIPPED
[INFO] Apache ZooKeeper - Recipes - Lock .................. SKIPPED
[INFO] Apache ZooKeeper - Recipes - Queue ................. SKIPPED
[INFO] Apache ZooKeeper - Assembly ........................ SKIPPED
[INFO] Apache ZooKeeper - Contrib ......................... SKIPPED
[INFO] Apache ZooKeeper - Contrib - Loggraph .............. SKIPPED
[INFO] Apache ZooKeeper - Contrib - Rest .................. SKIPPED
[INFO] Apache ZooKeeper - Contrib - ZooInspector .......... SKIPPED
[INFO] ------------------------------------------------------------------------
[INFO] BUILD FAILURE
[INFO] ------------------------------------------------------------------------
[INFO] Total time:  42.271 s
[INFO] Finished at: 2019-06-23T11:35:12Z
[INFO] ------------------------------------------------------------------------
Waiting for Jenkins to finish collecting data
[ERROR] Failed to execute goal org.apache.rat:apache-rat-plugin:0.11:check (default-cli) on
project zookeeper-docs: Too many files with unapproved license: 1 See RAT report in: <https://builds.apache.org/job/zookeeper-master-maven-jdk11/ws/zookeeper-docs/target/rat.txt>
-> [Help 1]
[ERROR] 
[ERROR] To see the full stack trace of the errors, re-run Maven with the -e switch.
[ERROR] Re-run Maven using the -X switch to enable full debug logging.
[ERROR] 
[ERROR] For more information about the errors and possible solutions, please read the following
articles:
[ERROR] [Help 1] http://cwiki.apache.org/confluence/display/MAVEN/MojoFailureException
[ERROR] 
[ERROR] After correcting the problems, you can resume the build with the command
[ERROR]   mvn <goals> -rf :zookeeper-docs
[JENKINS] Archiving <https://builds.apache.org/job/zookeeper-master-maven-jdk11/ws/zookeeper-server/pom.xml>
to org.apache.zookeeper/zookeeper/3.6.0-SNAPSHOT/zookeeper-3.6.0-SNAPSHOT.pom
[Fast Archiver] No prior successful build to compare, so performing full copy of artifacts
[JENKINS] Archiving <https://builds.apache.org/job/zookeeper-master-maven-jdk11/ws/zookeeper-contrib/zookeeper-contrib-loggraph/pom.xml>
to org.apache.zookeeper/zookeeper-contrib-loggraph/3.6.0-SNAPSHOT/zookeeper-contrib-loggraph-3.6.0-SNAPSHOT.pom
[Fast Archiver] No prior successful build to compare, so performing full copy of artifacts
[JENKINS] Archiving <https://builds.apache.org/job/zookeeper-master-maven-jdk11/ws/zookeeper-metrics-providers/pom.xml>
to org.apache.zookeeper/zookeeper-metrics-providers/3.6.0-SNAPSHOT/zookeeper-metrics-providers-3.6.0-SNAPSHOT.pom
[Fast Archiver] No prior successful build to compare, so performing full copy of artifacts
[JENKINS] Archiving <https://builds.apache.org/job/zookeeper-master-maven-jdk11/ws/zookeeper-metrics-providers/zookeeper-prometheus-metrics/pom.xml>
to org.apache.zookeeper/zookeeper-prometheus-metrics/3.6.0-SNAPSHOT/zookeeper-prometheus-metrics-3.6.0-SNAPSHOT.pom
[Fast Archiver] No prior successful build to compare, so performing full copy of artifacts
[JENKINS] Archiving <https://builds.apache.org/job/zookeeper-master-maven-jdk11/ws/zookeeper-recipes/zookeeper-recipes-election/pom.xml>
to org.apache.zookeeper/zookeeper-recipes-election/3.6.0-SNAPSHOT/zookeeper-recipes-election-3.6.0-SNAPSHOT.pom
[Fast Archiver] No prior successful build to compare, so performing full copy of artifacts
[JENKINS] Archiving <https://builds.apache.org/job/zookeeper-master-maven-jdk11/ws/pom.xml>
to org.apache.zookeeper/parent/3.6.0-SNAPSHOT/parent-3.6.0-SNAPSHOT.pom
[JENKINS] Archiving <https://builds.apache.org/job/zookeeper-master-maven-jdk11/ws/zookeeper-recipes/zookeeper-recipes-lock/pom.xml>
to org.apache.zookeeper/zookeeper-recipes-lock/3.6.0-SNAPSHOT/zookeeper-recipes-lock-3.6.0-SNAPSHOT.pom
[Fast Archiver] No prior successful build to compare, so performing full copy of artifacts
[JENKINS] Archiving <https://builds.apache.org/job/zookeeper-master-maven-jdk11/ws/zookeeper-contrib/pom.xml>
to org.apache.zookeeper/zookeeper-contrib/3.6.0-SNAPSHOT/zookeeper-contrib-3.6.0-SNAPSHOT.pom
[Fast Archiver] No prior successful build to compare, so performing full copy of artifacts
[JENKINS] Archiving <https://builds.apache.org/job/zookeeper-master-maven-jdk11/ws/zookeeper-client/pom.xml>
to org.apache.zookeeper/zookeeper-client/3.6.0-SNAPSHOT/zookeeper-client-3.6.0-SNAPSHOT.pom
[Fast Archiver] No prior successful build to compare, so performing full copy of artifacts
[JENKINS] Archiving <https://builds.apache.org/job/zookeeper-master-maven-jdk11/ws/zookeeper-jute/pom.xml>
to org.apache.zookeeper/zookeeper-jute/3.6.0-SNAPSHOT/zookeeper-jute-3.6.0-SNAPSHOT.pom
[Fast Archiver] No prior successful build to compare, so performing full copy of artifacts
[JENKINS] Archiving <https://builds.apache.org/job/zookeeper-master-maven-jdk11/ws/zookeeper-recipes/zookeeper-recipes-queue/pom.xml>
to org.apache.zookeeper/zookeeper-recipes-queue/3.6.0-SNAPSHOT/zookeeper-recipes-queue-3.6.0-SNAPSHOT.pom
[Fast Archiver] No prior successful build to compare, so performing full copy of artifacts
[JENKINS] Archiving <https://builds.apache.org/job/zookeeper-master-maven-jdk11/ws/zookeeper-docs/pom.xml>
to org.apache.zookeeper/zookeeper-docs/3.6.0-SNAPSHOT/zookeeper-docs-3.6.0-SNAPSHOT.pom
[Fast Archiver] No prior successful build to compare, so performing full copy of artifacts
[JENKINS] Archiving <https://builds.apache.org/job/zookeeper-master-maven-jdk11/ws/zookeeper-recipes/pom.xml>
to org.apache.zookeeper/zookeeper-recipes/3.6.0-SNAPSHOT/zookeeper-recipes-3.6.0-SNAPSHOT.pom
[Fast Archiver] No prior successful build to compare, so performing full copy of artifacts
[JENKINS] Archiving <https://builds.apache.org/job/zookeeper-master-maven-jdk11/ws/zookeeper-client/zookeeper-client-c/pom.xml>
to org.apache.zookeeper/zookeeper-client-c/3.6.0-SNAPSHOT/zookeeper-client-c-3.6.0-SNAPSHOT.pom
[Fast Archiver] No prior successful build to compare, so performing full copy of artifacts
[JENKINS] Archiving <https://builds.apache.org/job/zookeeper-master-maven-jdk11/ws/zookeeper-contrib/zookeeper-contrib-rest/pom.xml>
to org.apache.zookeeper/zookeeper-contrib-rest/3.6.0-SNAPSHOT/zookeeper-contrib-rest-3.6.0-SNAPSHOT.pom
[Fast Archiver] No prior successful build to compare, so performing full copy of artifacts
[JENKINS] Archiving <https://builds.apache.org/job/zookeeper-master-maven-jdk11/ws/zookeeper-assembly/pom.xml>
to org.apache.zookeeper/zookeeper-assembly/3.6.0-SNAPSHOT/zookeeper-assembly-3.6.0-SNAPSHOT.pom
[Fast Archiver] No prior successful build to compare, so performing full copy of artifacts
[JENKINS] Archiving <https://builds.apache.org/job/zookeeper-master-maven-jdk11/ws/zookeeper-contrib/zookeeper-contrib-zooinspector/pom.xml>
to org.apache.zookeeper/zookeeper-contrib-zooinspector/3.6.0-SNAPSHOT/zookeeper-contrib-zooinspector-3.6.0-SNAPSHOT.pom
[Fast Archiver] No prior successful build to compare, so performing full copy of artifacts
channel stopped
[SpotBugs] Skipping execution of recorder since overall result is 'FAILURE'

Mime
View raw message