zookeeper-dev mailing list archives

Site index · List index
Message view « Date » · « Thread »
Top « Date » · « Thread »
From Apache Jenkins Server <jenk...@builds.apache.org>
Subject Build failed in Jenkins: zookeeper-master-maven #277
Date Sun, 16 Jun 2019 01:08:47 GMT
See <https://builds.apache.org/job/zookeeper-master-maven/277/display/redirect>

------------------------------------------
Started by timer
[EnvInject] - Loading node environment variables.
Building remotely on H15 (Hadoop xenial) in workspace <https://builds.apache.org/job/zookeeper-master-maven/ws/>
[WS-CLEANUP] Deleting project workspace...
[WS-CLEANUP] Deferred wipeout is used...
[WS-CLEANUP] Done
No credentials specified
Cloning the remote Git repository
Using shallow clone
Avoid fetching tags
Cloning repository https://github.com/apache/zookeeper
 > git init <https://builds.apache.org/job/zookeeper-master-maven/ws/> # timeout=10
Fetching upstream changes from https://github.com/apache/zookeeper
 > git --version # timeout=10
 > git fetch --no-tags --progress https://github.com/apache/zookeeper +refs/heads/*:refs/remotes/origin/*
--depth=1
 > git config remote.origin.url https://github.com/apache/zookeeper # timeout=10
 > git config --add remote.origin.fetch +refs/heads/*:refs/remotes/origin/* # timeout=10
 > git config remote.origin.url https://github.com/apache/zookeeper # timeout=10
Fetching upstream changes from https://github.com/apache/zookeeper
 > git fetch --no-tags --progress https://github.com/apache/zookeeper +refs/heads/*:refs/remotes/origin/*
--depth=1
 > git rev-parse refs/remotes/origin/master^{commit} # timeout=10
 > git rev-parse refs/remotes/origin/origin/master^{commit} # timeout=10
Checking out Revision 3d666f1a6c19779c73e8636bb7f65b5230d3fda0 (refs/remotes/origin/master)
 > git config core.sparsecheckout # timeout=10
 > git checkout -f 3d666f1a6c19779c73e8636bb7f65b5230d3fda0
Commit message: "ZOOKEEPER-3288: add a new doc:ZookeeperCLI.md"
 > git rev-list --no-walk 3d666f1a6c19779c73e8636bb7f65b5230d3fda0 # timeout=10
Parsing POMs
Modules changed, recalculating dependency graph
Established TCP socket on 39086
maven35-agent.jar already up to date
maven35-interceptor.jar already up to date
maven3-interceptor-commons.jar already up to date
[zookeeper-master-maven] $ /home/jenkins/tools/java/latest1.8/bin/java -Xmx4g -Xms4g -cp /home/jenkins/jenkins-slave/maven35-agent.jar:/home/jenkins/tools/maven/apache-maven-3.6.0/boot/plexus-classworlds-2.5.2.jar:/home/jenkins/tools/maven/apache-maven-3.6.0/conf/logging
jenkins.maven3.agent.Maven35Main /home/jenkins/tools/maven/apache-maven-3.6.0 /home/jenkins/jenkins-slave/remoting.jar
/home/jenkins/jenkins-slave/maven35-interceptor.jar /home/jenkins/jenkins-slave/maven3-interceptor-commons.jar
39086
<===[JENKINS REMOTING CAPACITY]===>   channel started
Executing Maven:  -B -f <https://builds.apache.org/job/zookeeper-master-maven/ws/pom.xml>
-Dmaven.repo.local=/home/jenkins/jenkins-slave/maven-repositories/0 apache-rat:check verify
spotbugs:check checkstyle:check -Pfull-build
[INFO] Scanning for projects...
[INFO] ------------------------------------------------------------------------
[INFO] Reactor Build Order:
[INFO] 
[INFO] Apache ZooKeeper                                                   [pom]
[INFO] Apache ZooKeeper - Documentation                                   [jar]
[INFO] Apache ZooKeeper - Jute                                            [jar]
[INFO] Apache ZooKeeper - Server                                          [jar]
[INFO] Apache ZooKeeper - Metrics Providers                               [pom]
[INFO] Apache ZooKeeper - Prometheus.io Metrics Provider                  [jar]
[INFO] Apache ZooKeeper - Client                                          [pom]
[INFO] Apache ZooKeeper - Client - C                                      [jar]
[INFO] Apache ZooKeeper - Recipes                                         [pom]
[INFO] Apache ZooKeeper - Recipes - Election                              [jar]
[INFO] Apache ZooKeeper - Recipes - Lock                                  [jar]
[INFO] Apache ZooKeeper - Recipes - Queue                                 [jar]
[INFO] Apache ZooKeeper - Assembly                                        [pom]
[INFO] Apache ZooKeeper - Contrib                                         [pom]
[INFO] Apache ZooKeeper - Contrib - Loggraph                              [jar]
[INFO] Apache ZooKeeper - Contrib - Rest                                  [jar]
[INFO] Apache ZooKeeper - Contrib - ZooInspector                          [jar]
[INFO] Downloading from central: https://repo.maven.apache.org/maven2/org/owasp/dependency-check-maven/4.0.2/dependency-check-maven-4.0.2.pom
[INFO] Downloaded from central: https://repo.maven.apache.org/maven2/org/owasp/dependency-check-maven/4.0.2/dependency-check-maven-4.0.2.pom
(9.4 kB at 32 kB/s)
[INFO] Downloading from central: https://repo.maven.apache.org/maven2/org/owasp/dependency-check-parent/4.0.2/dependency-check-parent-4.0.2.pom
[INFO] Downloaded from central: https://repo.maven.apache.org/maven2/org/owasp/dependency-check-parent/4.0.2/dependency-check-parent-4.0.2.pom
(50 kB at 1.8 MB/s)
[INFO] Downloading from central: https://repo.maven.apache.org/maven2/org/owasp/dependency-check-maven/4.0.2/dependency-check-maven-4.0.2.jar
[INFO] Downloaded from central: https://repo.maven.apache.org/maven2/org/owasp/dependency-check-maven/4.0.2/dependency-check-maven-4.0.2.jar
(80 kB at 3.3 MB/s)
[INFO] Downloading from central: https://repo.maven.apache.org/maven2/org/apache/maven/plugins/maven-failsafe-plugin/2.19.1/maven-failsafe-plugin-2.19.1.pom
[INFO] Downloaded from central: https://repo.maven.apache.org/maven2/org/apache/maven/plugins/maven-failsafe-plugin/2.19.1/maven-failsafe-plugin-2.19.1.pom
(9.6 kB at 505 kB/s)
[INFO] Downloading from central: https://repo.maven.apache.org/maven2/org/apache/maven/plugins/maven-failsafe-plugin/2.19.1/maven-failsafe-plugin-2.19.1.jar
[INFO] Downloaded from central: https://repo.maven.apache.org/maven2/org/apache/maven/plugins/maven-failsafe-plugin/2.19.1/maven-failsafe-plugin-2.19.1.jar
(87 kB at 3.0 MB/s)
[INFO] Downloading from central: https://repo.maven.apache.org/maven2/org/apache/maven/plugins/maven-invoker-plugin/2.0.0/maven-invoker-plugin-2.0.0.pom
[INFO] Downloaded from central: https://repo.maven.apache.org/maven2/org/apache/maven/plugins/maven-invoker-plugin/2.0.0/maven-invoker-plugin-2.0.0.pom
(11 kB at 459 kB/s)
[INFO] Downloading from central: https://repo.maven.apache.org/maven2/org/apache/maven/plugins/maven-invoker-plugin/2.0.0/maven-invoker-plugin-2.0.0.jar
[INFO] Downloaded from central: https://repo.maven.apache.org/maven2/org/apache/maven/plugins/maven-invoker-plugin/2.0.0/maven-invoker-plugin-2.0.0.jar
(108 kB at 4.2 MB/s)
[INFO] Downloading from central: https://repo.maven.apache.org/maven2/org/apache/maven/plugins/maven-plugin-plugin/3.4/maven-plugin-plugin-3.4.pom
[INFO] Downloaded from central: https://repo.maven.apache.org/maven2/org/apache/maven/plugins/maven-plugin-plugin/3.4/maven-plugin-plugin-3.4.pom
(14 kB at 691 kB/s)
[INFO] Downloading from central: https://repo.maven.apache.org/maven2/org/apache/maven/plugins/maven-plugin-plugin/3.4/maven-plugin-plugin-3.4.jar
[INFO] Downloaded from central: https://repo.maven.apache.org/maven2/org/apache/maven/plugins/maven-plugin-plugin/3.4/maven-plugin-plugin-3.4.jar
(50 kB at 2.9 MB/s)
[INFO] Downloading from central: https://repo.maven.apache.org/maven2/org/apache/maven/plugins/maven-project-info-reports-plugin/2.9/maven-project-info-reports-plugin-2.9.pom
[INFO] Downloaded from central: https://repo.maven.apache.org/maven2/org/apache/maven/plugins/maven-project-info-reports-plugin/2.9/maven-project-info-reports-plugin-2.9.pom
(19 kB at 1.1 MB/s)
[INFO] Downloading from central: https://repo.maven.apache.org/maven2/org/apache/maven/plugins/maven-project-info-reports-plugin/2.9/maven-project-info-reports-plugin-2.9.jar
[INFO] Downloaded from central: https://repo.maven.apache.org/maven2/org/apache/maven/plugins/maven-project-info-reports-plugin/2.9/maven-project-info-reports-plugin-2.9.jar
(303 kB at 5.4 MB/s)
[INFO] Downloading from central: https://repo.maven.apache.org/maven2/org/apache/maven/plugins/maven-scm-plugin/1.9.4/maven-scm-plugin-1.9.4.pom
[INFO] Downloaded from central: https://repo.maven.apache.org/maven2/org/apache/maven/plugins/maven-scm-plugin/1.9.4/maven-scm-plugin-1.9.4.pom
(6.9 kB at 434 kB/s)
[INFO] Downloading from central: https://repo.maven.apache.org/maven2/org/apache/maven/scm/maven-scm/1.9.4/maven-scm-1.9.4.pom
[INFO] Downloaded from central: https://repo.maven.apache.org/maven2/org/apache/maven/scm/maven-scm/1.9.4/maven-scm-1.9.4.pom
(22 kB at 1.4 MB/s)
[INFO] Downloading from central: https://repo.maven.apache.org/maven2/org/apache/maven/plugins/maven-scm-plugin/1.9.4/maven-scm-plugin-1.9.4.jar
[INFO] Downloaded from central: https://repo.maven.apache.org/maven2/org/apache/maven/plugins/maven-scm-plugin/1.9.4/maven-scm-plugin-1.9.4.jar
(63 kB at 2.7 MB/s)
[INFO] Downloading from central: https://repo.maven.apache.org/maven2/org/apache/maven/plugins/maven-scm-publish-plugin/1.1/maven-scm-publish-plugin-1.1.pom
[INFO] Downloaded from central: https://repo.maven.apache.org/maven2/org/apache/maven/plugins/maven-scm-publish-plugin/1.1/maven-scm-publish-plugin-1.1.pom
(6.9 kB at 460 kB/s)
[INFO] Downloading from central: https://repo.maven.apache.org/maven2/org/apache/maven/plugins/maven-scm-publish-plugin/1.1/maven-scm-publish-plugin-1.1.jar
[INFO] Downloaded from central: https://repo.maven.apache.org/maven2/org/apache/maven/plugins/maven-scm-publish-plugin/1.1/maven-scm-publish-plugin-1.1.jar
(38 kB at 1.9 MB/s)
[INFO] Downloading from central: https://repo.maven.apache.org/maven2/org/apache/maven/plugins/maven-surefire-report-plugin/2.19.1/maven-surefire-report-plugin-2.19.1.pom
[INFO] Downloaded from central: https://repo.maven.apache.org/maven2/org/apache/maven/plugins/maven-surefire-report-plugin/2.19.1/maven-surefire-report-plugin-2.19.1.pom
(6.4 kB at 400 kB/s)
[INFO] Downloading from central: https://repo.maven.apache.org/maven2/org/apache/maven/plugins/maven-surefire-report-plugin/2.19.1/maven-surefire-report-plugin-2.19.1.jar
[INFO] Downloaded from central: https://repo.maven.apache.org/maven2/org/apache/maven/plugins/maven-surefire-report-plugin/2.19.1/maven-surefire-report-plugin-2.19.1.jar
(39 kB at 2.1 MB/s)
[INFO] Downloading from central: https://repo.maven.apache.org/maven2/org/apache/maven/plugins/maven-war-plugin/2.6/maven-war-plugin-2.6.pom
[INFO] Downloaded from central: https://repo.maven.apache.org/maven2/org/apache/maven/plugins/maven-war-plugin/2.6/maven-war-plugin-2.6.pom
(8.2 kB at 548 kB/s)
[INFO] Downloading from central: https://repo.maven.apache.org/maven2/org/apache/maven/plugins/maven-war-plugin/2.6/maven-war-plugin-2.6.jar
[INFO] Downloaded from central: https://repo.maven.apache.org/maven2/org/apache/maven/plugins/maven-war-plugin/2.6/maven-war-plugin-2.6.jar
(88 kB at 4.6 MB/s)
[INFO] Downloading from central: https://repo.maven.apache.org/maven2/org/codehaus/mojo/clirr-maven-plugin/2.7/clirr-maven-plugin-2.7.pom
[INFO] Downloaded from central: https://repo.maven.apache.org/maven2/org/codehaus/mojo/clirr-maven-plugin/2.7/clirr-maven-plugin-2.7.pom
(8.1 kB at 475 kB/s)
[INFO] Downloading from central: https://repo.maven.apache.org/maven2/org/codehaus/mojo/clirr-maven-plugin/2.7/clirr-maven-plugin-2.7.jar
[INFO] Downloaded from central: https://repo.maven.apache.org/maven2/org/codehaus/mojo/clirr-maven-plugin/2.7/clirr-maven-plugin-2.7.jar
(73 kB at 3.5 MB/s)
[INFO] 
[INFO] --------------------< org.apache.zookeeper:parent >---------------------
[INFO] Building Apache ZooKeeper 3.6.0-SNAPSHOT                          [1/17]
[INFO] --------------------------------[ pom ]---------------------------------
[INFO] 
[INFO] --- apache-rat-plugin:0.11:check (default-cli) @ parent ---
[INFO] 59 implicit excludes (use -debug for more details).
[INFO] Exclude: **/log4j.properties
[INFO] Exclude: **/README.md
[INFO] Exclude: **/git.properties
[INFO] Exclude: **/findbugsExcludeFile.xml
[INFO] Exclude: **/checkstyle-noframes-sorted.xsl
[INFO] Exclude: **/configure.ac
[INFO] Exclude: **/Makefile.am
[INFO] Exclude: conf/zoo_sample.cfg
[INFO] Exclude: conf/configuration.xsl
[INFO] Exclude: .travis.yml
[INFO] Exclude: excludeFindBugsFilter.xml
[INFO] Exclude: README_packaging.txt
[INFO] Exclude: src/main/resources/markdown/skin/*
[INFO] Exclude: src/main/resources/markdown/html/*
[INFO] Exclude: zookeeper-contrib/zookeeper-contrib-loggraph/src/main/resources/webapp/org/apache/zookeeper/graph/resources/*
[INFO] Exclude: zookeeper-contrib/zookeeper-contrib-zooinspector/TODO
[INFO] Exclude: zookeeper-contrib/zookeeper-contrib-zkperl/Changes
[INFO] Exclude: zookeeper-contrib/zookeeper-contrib-zkperl/MANIFEST
[INFO] Exclude: zookeeper-contrib/zookeeper-contrib-fatjar/src/main/resources/mainClasses
[INFO] Exclude: zookeeper-contrib/zookeeper-contrib-monitoring/JMX-RESOURCES
[INFO] Exclude: zookeeper-contrib/zookeeper-contrib-zooinspector/src/main/java/com/nitido/utils/toaster/Toaster.java
[INFO] Exclude: **/acinclude.m4
[INFO] Exclude: **/aminclude.am
[INFO] Exclude: zookeeper-client-c/src/hashtable/*
[INFO] Exclude: zookeeper-client-c/include/winconfig.h
[INFO] Exclude: zookeeper-client-c/tests/wrappers.opt
[INFO] Exclude: zookeeper-client-c/tests/quorum.cfg
[INFO] Exclude: zookeeper-client-c/tests/wrappers-mt.opt
[INFO] Exclude: **/c-doc.Doxyfile
[INFO] 35 resources included (use -debug for more details)
[INFO] Rat check: Summary of files. Unapproved: 0 unknown: 0 generated: 0 approved: 31 licence.
[INFO] 
[INFO] --- git-commit-id-plugin:2.2.5:revision (find-current-git-revision) @ parent ---
[INFO] ------------------------------------------------------------------------
[INFO] Reactor Summary for Apache ZooKeeper 3.6.0-SNAPSHOT:
[INFO] 
[INFO] Apache ZooKeeper ................................... FAILURE [  6.114 s]
[INFO] Apache ZooKeeper - Documentation ................... SKIPPED
[INFO] Apache ZooKeeper - Jute ............................ SKIPPED
[INFO] Apache ZooKeeper - Server .......................... SKIPPED
[INFO] Apache ZooKeeper - Metrics Providers ............... SKIPPED
[INFO] Apache ZooKeeper - Prometheus.io Metrics Provider .. SKIPPED
[INFO] Apache ZooKeeper - Client .......................... SKIPPED
[INFO] Apache ZooKeeper - Client - C ...................... SKIPPED
[INFO] Apache ZooKeeper - Recipes ......................... SKIPPED
[INFO] Apache ZooKeeper - Recipes - Election .............. SKIPPED
[INFO] Apache ZooKeeper - Recipes - Lock .................. SKIPPED
[INFO] Apache ZooKeeper - Recipes - Queue ................. SKIPPED
[INFO] Apache ZooKeeper - Assembly ........................ SKIPPED
[INFO] Apache ZooKeeper - Contrib ......................... SKIPPED
[INFO] Apache ZooKeeper - Contrib - Loggraph .............. SKIPPED
[INFO] Apache ZooKeeper - Contrib - Rest .................. SKIPPED
[INFO] Apache ZooKeeper - Contrib - ZooInspector .......... SKIPPED
[INFO] ------------------------------------------------------------------------
[INFO] BUILD FAILURE
[INFO] ------------------------------------------------------------------------
[INFO] Total time:  26.762 s
[INFO] Finished at: 2019-06-16T01:08:07Z
[INFO] ------------------------------------------------------------------------
Waiting for Jenkins to finish collecting data
[ERROR] Failed to execute goal pl.project13.maven:git-commit-id-plugin:2.2.5:revision (find-current-git-revision)
on project parent: Could not complete Mojo execution... Unable to find commits until some
tag: Walk failure. Missing commit 0fcb3f6f6c96dfc7e1842a39fa47c624b7fb1960 -> [Help 1]
[ERROR] 
[ERROR] To see the full stack trace of the errors, re-run Maven with the -e switch.
[ERROR] Re-run Maven using the -X switch to enable full debug logging.
[ERROR] 
[ERROR] For more information about the errors and possible solutions, please read the following
articles:
[ERROR] [Help 1] http://cwiki.apache.org/confluence/display/MAVEN/MojoExecutionException
[JENKINS] Archiving <https://builds.apache.org/job/zookeeper-master-maven/ws/zookeeper-server/pom.xml>
to org.apache.zookeeper/zookeeper/3.6.0-SNAPSHOT/zookeeper-3.6.0-SNAPSHOT.pom
[JENKINS] Archiving <https://builds.apache.org/job/zookeeper-master-maven/ws/zookeeper-contrib/zookeeper-contrib-loggraph/pom.xml>
to org.apache.zookeeper/zookeeper-contrib-loggraph/3.6.0-SNAPSHOT/zookeeper-contrib-loggraph-3.6.0-SNAPSHOT.pom
[JENKINS] Archiving <https://builds.apache.org/job/zookeeper-master-maven/ws/zookeeper-metrics-providers/pom.xml>
to org.apache.zookeeper/zookeeper-metrics-providers/3.6.0-SNAPSHOT/zookeeper-metrics-providers-3.6.0-SNAPSHOT.pom
[Fast Archiver] No prior successful build to compare, so performing full copy of artifacts
[JENKINS] Archiving <https://builds.apache.org/job/zookeeper-master-maven/ws/zookeeper-metrics-providers/zookeeper-prometheus-metrics/pom.xml>
to org.apache.zookeeper/zookeeper-prometheus-metrics/3.6.0-SNAPSHOT/zookeeper-prometheus-metrics-3.6.0-SNAPSHOT.pom
[Fast Archiver] No prior successful build to compare, so performing full copy of artifacts
[JENKINS] Archiving <https://builds.apache.org/job/zookeeper-master-maven/ws/zookeeper-recipes/zookeeper-recipes-election/pom.xml>
to org.apache.zookeeper/zookeeper-recipes-election/3.6.0-SNAPSHOT/zookeeper-recipes-election-3.6.0-SNAPSHOT.pom
[JENKINS] Archiving <https://builds.apache.org/job/zookeeper-master-maven/ws/pom.xml>
to org.apache.zookeeper/parent/3.6.0-SNAPSHOT/parent-3.6.0-SNAPSHOT.pom
[Fast Archiver] No prior successful build to compare, so performing full copy of artifacts
[JENKINS] Archiving <https://builds.apache.org/job/zookeeper-master-maven/ws/zookeeper-recipes/zookeeper-recipes-lock/pom.xml>
to org.apache.zookeeper/zookeeper-recipes-lock/3.6.0-SNAPSHOT/zookeeper-recipes-lock-3.6.0-SNAPSHOT.pom
[JENKINS] Archiving <https://builds.apache.org/job/zookeeper-master-maven/ws/zookeeper-contrib/pom.xml>
to org.apache.zookeeper/zookeeper-contrib/3.6.0-SNAPSHOT/zookeeper-contrib-3.6.0-SNAPSHOT.pom
[JENKINS] Archiving <https://builds.apache.org/job/zookeeper-master-maven/ws/zookeeper-client/pom.xml>
to org.apache.zookeeper/zookeeper-client/3.6.0-SNAPSHOT/zookeeper-client-3.6.0-SNAPSHOT.pom
[JENKINS] Archiving <https://builds.apache.org/job/zookeeper-master-maven/ws/zookeeper-jute/pom.xml>
to org.apache.zookeeper/zookeeper-jute/3.6.0-SNAPSHOT/zookeeper-jute-3.6.0-SNAPSHOT.pom
[JENKINS] Archiving <https://builds.apache.org/job/zookeeper-master-maven/ws/zookeeper-recipes/zookeeper-recipes-queue/pom.xml>
to org.apache.zookeeper/zookeeper-recipes-queue/3.6.0-SNAPSHOT/zookeeper-recipes-queue-3.6.0-SNAPSHOT.pom
[JENKINS] Archiving <https://builds.apache.org/job/zookeeper-master-maven/ws/zookeeper-docs/pom.xml>
to org.apache.zookeeper/zookeeper-docs/3.6.0-SNAPSHOT/zookeeper-docs-3.6.0-SNAPSHOT.pom
[JENKINS] Archiving <https://builds.apache.org/job/zookeeper-master-maven/ws/zookeeper-recipes/pom.xml>
to org.apache.zookeeper/zookeeper-recipes/3.6.0-SNAPSHOT/zookeeper-recipes-3.6.0-SNAPSHOT.pom
[JENKINS] Archiving <https://builds.apache.org/job/zookeeper-master-maven/ws/zookeeper-client/zookeeper-client-c/pom.xml>
to org.apache.zookeeper/zookeeper-client-c/3.6.0-SNAPSHOT/zookeeper-client-c-3.6.0-SNAPSHOT.pom
[JENKINS] Archiving <https://builds.apache.org/job/zookeeper-master-maven/ws/zookeeper-contrib/zookeeper-contrib-rest/pom.xml>
to org.apache.zookeeper/zookeeper-contrib-rest/3.6.0-SNAPSHOT/zookeeper-contrib-rest-3.6.0-SNAPSHOT.pom
[JENKINS] Archiving <https://builds.apache.org/job/zookeeper-master-maven/ws/zookeeper-assembly/pom.xml>
to org.apache.zookeeper/zookeeper-assembly/3.6.0-SNAPSHOT/zookeeper-assembly-3.6.0-SNAPSHOT.pom
[Fast Archiver] No prior successful build to compare, so performing full copy of artifacts
[JENKINS] Archiving <https://builds.apache.org/job/zookeeper-master-maven/ws/zookeeper-contrib/zookeeper-contrib-zooinspector/pom.xml>
to org.apache.zookeeper/zookeeper-contrib-zooinspector/3.6.0-SNAPSHOT/zookeeper-contrib-zooinspector-3.6.0-SNAPSHOT.pom
channel stopped
[SpotBugs] Skipping execution of recorder since overall result is 'FAILURE'

Mime
View raw message