zookeeper-dev mailing list archives

Site index · List index
Message view « Date » · « Thread »
Top « Date » · « Thread »
From Apache Jenkins Server <jenk...@builds.apache.org>
Subject Build failed in Jenkins: PreCommit-ZOOKEEPER-github-pr-build-maven #851
Date Sat, 22 Jun 2019 07:41:49 GMT
See <https://builds.apache.org/job/PreCommit-ZOOKEEPER-github-pr-build-maven/851/display/redirect>

------------------------------------------
[...truncated 688.22 KB...]
Generating <https://builds.apache.org/job/PreCommit-ZOOKEEPER-github-pr-build-maven/ws/zookeeper-server/target/apidocs/org/apache/zookeeper/cli/class-use/GetEphemeralsCommand.html...>
Generating <https://builds.apache.org/job/PreCommit-ZOOKEEPER-github-pr-build-maven/ws/zookeeper-server/target/apidocs/org/apache/zookeeper/cli/class-use/SetAclCommand.html...>
Generating <https://builds.apache.org/job/PreCommit-ZOOKEEPER-github-pr-build-maven/ws/zookeeper-server/target/apidocs/org/apache/zookeeper/cli/class-use/StatPrinter.html...>
Generating <https://builds.apache.org/job/PreCommit-ZOOKEEPER-github-pr-build-maven/ws/zookeeper-server/target/apidocs/org/apache/zookeeper/cli/class-use/DeleteCommand.html...>
Generating <https://builds.apache.org/job/PreCommit-ZOOKEEPER-github-pr-build-maven/ws/zookeeper-server/target/apidocs/org/apache/zookeeper/cli/class-use/CliParseException.html...>
Generating <https://builds.apache.org/job/PreCommit-ZOOKEEPER-github-pr-build-maven/ws/zookeeper-server/target/apidocs/org/apache/zookeeper/cli/class-use/AclParser.html...>
Generating <https://builds.apache.org/job/PreCommit-ZOOKEEPER-github-pr-build-maven/ws/zookeeper-server/target/apidocs/org/apache/zookeeper/cli/class-use/RemoveWatchesCommand.html...>
Generating <https://builds.apache.org/job/PreCommit-ZOOKEEPER-github-pr-build-maven/ws/zookeeper-server/target/apidocs/org/apache/zookeeper/cli/class-use/CreateCommand.html...>
Generating <https://builds.apache.org/job/PreCommit-ZOOKEEPER-github-pr-build-maven/ws/zookeeper-server/target/apidocs/org/apache/zookeeper/cli/class-use/CloseCommand.html...>
Generating <https://builds.apache.org/job/PreCommit-ZOOKEEPER-github-pr-build-maven/ws/zookeeper-server/target/apidocs/org/apache/zookeeper/cli/class-use/AddAuthCommand.html...>
Generating <https://builds.apache.org/job/PreCommit-ZOOKEEPER-github-pr-build-maven/ws/zookeeper-server/target/apidocs/org/apache/zookeeper/cli/class-use/CliException.html...>
Generating <https://builds.apache.org/job/PreCommit-ZOOKEEPER-github-pr-build-maven/ws/zookeeper-server/target/apidocs/org/apache/zookeeper/cli/class-use/CommandNotFoundException.html...>
Generating <https://builds.apache.org/job/PreCommit-ZOOKEEPER-github-pr-build-maven/ws/zookeeper-server/target/apidocs/org/apache/zookeeper/cli/class-use/MalformedCommandException.html...>
Generating <https://builds.apache.org/job/PreCommit-ZOOKEEPER-github-pr-build-maven/ws/zookeeper-server/target/apidocs/org/apache/zookeeper/package-use.html...>
Generating <https://builds.apache.org/job/PreCommit-ZOOKEEPER-github-pr-build-maven/ws/zookeeper-server/target/apidocs/org/apache/zookeeper/admin/package-use.html...>
Generating <https://builds.apache.org/job/PreCommit-ZOOKEEPER-github-pr-build-maven/ws/zookeeper-server/target/apidocs/org/apache/zookeeper/cli/package-use.html...>
Generating <https://builds.apache.org/job/PreCommit-ZOOKEEPER-github-pr-build-maven/ws/zookeeper-server/target/apidocs/org/apache/zookeeper/client/package-use.html...>
Generating <https://builds.apache.org/job/PreCommit-ZOOKEEPER-github-pr-build-maven/ws/zookeeper-server/target/apidocs/org/apache/zookeeper/common/package-use.html...>
Generating <https://builds.apache.org/job/PreCommit-ZOOKEEPER-github-pr-build-maven/ws/zookeeper-server/target/apidocs/org/apache/zookeeper/jmx/package-use.html...>
Generating <https://builds.apache.org/job/PreCommit-ZOOKEEPER-github-pr-build-maven/ws/zookeeper-server/target/apidocs/org/apache/zookeeper/metrics/package-use.html...>
Generating <https://builds.apache.org/job/PreCommit-ZOOKEEPER-github-pr-build-maven/ws/zookeeper-server/target/apidocs/org/apache/zookeeper/metrics/impl/package-use.html...>
Generating <https://builds.apache.org/job/PreCommit-ZOOKEEPER-github-pr-build-maven/ws/zookeeper-server/target/apidocs/org/apache/zookeeper/server/package-use.html...>
Generating <https://builds.apache.org/job/PreCommit-ZOOKEEPER-github-pr-build-maven/ws/zookeeper-server/target/apidocs/org/apache/zookeeper/server/admin/package-use.html...>
Generating <https://builds.apache.org/job/PreCommit-ZOOKEEPER-github-pr-build-maven/ws/zookeeper-server/target/apidocs/org/apache/zookeeper/server/auth/package-use.html...>
Generating <https://builds.apache.org/job/PreCommit-ZOOKEEPER-github-pr-build-maven/ws/zookeeper-server/target/apidocs/org/apache/zookeeper/server/command/package-use.html...>
Generating <https://builds.apache.org/job/PreCommit-ZOOKEEPER-github-pr-build-maven/ws/zookeeper-server/target/apidocs/org/apache/zookeeper/server/metric/package-use.html...>
Generating <https://builds.apache.org/job/PreCommit-ZOOKEEPER-github-pr-build-maven/ws/zookeeper-server/target/apidocs/org/apache/zookeeper/server/persistence/package-use.html...>
Generating <https://builds.apache.org/job/PreCommit-ZOOKEEPER-github-pr-build-maven/ws/zookeeper-server/target/apidocs/org/apache/zookeeper/server/quorum/package-use.html...>
Generating <https://builds.apache.org/job/PreCommit-ZOOKEEPER-github-pr-build-maven/ws/zookeeper-server/target/apidocs/org/apache/zookeeper/server/quorum/auth/package-use.html...>
Generating <https://builds.apache.org/job/PreCommit-ZOOKEEPER-github-pr-build-maven/ws/zookeeper-server/target/apidocs/org/apache/zookeeper/server/quorum/flexible/package-use.html...>
Generating <https://builds.apache.org/job/PreCommit-ZOOKEEPER-github-pr-build-maven/ws/zookeeper-server/target/apidocs/org/apache/zookeeper/server/util/package-use.html...>
Generating <https://builds.apache.org/job/PreCommit-ZOOKEEPER-github-pr-build-maven/ws/zookeeper-server/target/apidocs/org/apache/zookeeper/server/watch/package-use.html...>
Generating <https://builds.apache.org/job/PreCommit-ZOOKEEPER-github-pr-build-maven/ws/zookeeper-server/target/apidocs/org/apache/zookeeper/util/package-use.html...>
Generating <https://builds.apache.org/job/PreCommit-ZOOKEEPER-github-pr-build-maven/ws/zookeeper-server/target/apidocs/org/apache/zookeeper/version/package-use.html...>
Generating <https://builds.apache.org/job/PreCommit-ZOOKEEPER-github-pr-build-maven/ws/zookeeper-server/target/apidocs/org/apache/zookeeper/version/util/package-use.html...>
Building index for all the packages and classes...
Generating <https://builds.apache.org/job/PreCommit-ZOOKEEPER-github-pr-build-maven/ws/zookeeper-server/target/apidocs/overview-tree.html...>
Generating <https://builds.apache.org/job/PreCommit-ZOOKEEPER-github-pr-build-maven/ws/zookeeper-server/target/apidocs/index-all.html...>
Generating <https://builds.apache.org/job/PreCommit-ZOOKEEPER-github-pr-build-maven/ws/zookeeper-server/target/apidocs/deprecated-list.html...>
Building index for all classes...
Generating <https://builds.apache.org/job/PreCommit-ZOOKEEPER-github-pr-build-maven/ws/zookeeper-server/target/apidocs/allclasses-frame.html...>
Generating <https://builds.apache.org/job/PreCommit-ZOOKEEPER-github-pr-build-maven/ws/zookeeper-server/target/apidocs/allclasses-noframe.html...>
Generating <https://builds.apache.org/job/PreCommit-ZOOKEEPER-github-pr-build-maven/ws/zookeeper-server/target/apidocs/index.html...>
Generating <https://builds.apache.org/job/PreCommit-ZOOKEEPER-github-pr-build-maven/ws/zookeeper-server/target/apidocs/overview-summary.html...>
Generating <https://builds.apache.org/job/PreCommit-ZOOKEEPER-github-pr-build-maven/ws/zookeeper-server/target/apidocs/help-doc.html...>
20 warnings
[WARNING] Javadoc Warnings
[WARNING] <https://builds.apache.org/job/PreCommit-ZOOKEEPER-github-pr-build-maven/ws/zookeeper-server/src/main/java/org/apache/zookeeper/server/ServerCnxn.java>:367:
warning - Tag @see: missing '#': "dumpConnectionInfo(PrintWriter, boolean) for brief stats"
[WARNING] <https://builds.apache.org/job/PreCommit-ZOOKEEPER-github-pr-build-maven/ws/zookeeper-server/src/main/java/org/apache/zookeeper/server/ZKDatabase.java>:489:
warning - @return tag has no arguments.
[WARNING] <https://builds.apache.org/job/PreCommit-ZOOKEEPER-github-pr-build-maven/ws/zookeeper-server/src/main/java/org/apache/zookeeper/server/persistence/FileTxnLog.java>:312:
warning - @return tag has no arguments.
[WARNING] <https://builds.apache.org/job/PreCommit-ZOOKEEPER-github-pr-build-maven/ws/zookeeper-server/src/main/java/org/apache/zookeeper/server/persistence/FileTxnSnapLog.java>:509:
warning - @return tag has no arguments.
[WARNING] <https://builds.apache.org/job/PreCommit-ZOOKEEPER-github-pr-build-maven/ws/zookeeper-server/src/main/java/org/apache/zookeeper/server/persistence/SnapStream.java>:222:
warning - @return tag has no arguments.
[WARNING] <https://builds.apache.org/job/PreCommit-ZOOKEEPER-github-pr-build-maven/ws/zookeeper-server/src/main/java/org/apache/zookeeper/server/persistence/Util.java>:257:
warning - @return tag has no arguments.
[WARNING] <https://builds.apache.org/job/PreCommit-ZOOKEEPER-github-pr-build-maven/ws/zookeeper-server/src/main/java/org/apache/zookeeper/server/persistence/Util.java>:267:
warning - @return tag has no arguments.
[WARNING] <https://builds.apache.org/job/PreCommit-ZOOKEEPER-github-pr-build-maven/ws/zookeeper-server/src/main/java/org/apache/zookeeper/server/quorum/Learner.java>:80:
warning - @return tag has no arguments.
[WARNING] <https://builds.apache.org/job/PreCommit-ZOOKEEPER-github-pr-build-maven/ws/zookeeper-server/src/main/java/org/apache/zookeeper/server/quorum/Leader.java>:1139:
warning - @return tag has no arguments.
[WARNING] <https://builds.apache.org/job/PreCommit-ZOOKEEPER-github-pr-build-maven/ws/zookeeper-server/src/main/java/org/apache/zookeeper/server/quorum/LearnerMaster.java>:74:
warning - @return tag has no arguments.
[WARNING] <https://builds.apache.org/job/PreCommit-ZOOKEEPER-github-pr-build-maven/ws/zookeeper-server/src/main/java/org/apache/zookeeper/server/quorum/Leader.java>:262:
warning - @param argument "qv," is not a parameter name.
[WARNING] <https://builds.apache.org/job/PreCommit-ZOOKEEPER-github-pr-build-maven/ws/zookeeper-server/src/main/java/org/apache/zookeeper/server/quorum/Leader.java>:907:
warning - @param argument "zxid," is not a parameter name.
[WARNING] <https://builds.apache.org/job/PreCommit-ZOOKEEPER-github-pr-build-maven/ws/zookeeper-server/src/main/java/org/apache/zookeeper/server/quorum/Leader.java>:907:
warning - @param argument "sid," is not a parameter name.
[WARNING] <https://builds.apache.org/job/PreCommit-ZOOKEEPER-github-pr-build-maven/ws/zookeeper-server/src/main/java/org/apache/zookeeper/server/quorum/LearnerHandler.java>:1048:
warning - @return tag has no arguments.
[WARNING] <https://builds.apache.org/job/PreCommit-ZOOKEEPER-github-pr-build-maven/ws/zookeeper-server/src/main/java/org/apache/zookeeper/server/quorum/QuorumPeer.java>:1798:
warning - @return tag has no arguments.
[WARNING] <https://builds.apache.org/job/PreCommit-ZOOKEEPER-github-pr-build-maven/ws/zookeeper-server/src/main/java/org/apache/zookeeper/cli/AclParser.java>:36:
warning - @return tag has no arguments.
[WARNING] <https://builds.apache.org/job/PreCommit-ZOOKEEPER-github-pr-build-maven/ws/zookeeper-server/src/main/java/org/apache/zookeeper/cli/CliCommand.java>:75:
warning - @return tag has no arguments.
[WARNING] <https://builds.apache.org/job/PreCommit-ZOOKEEPER-github-pr-build-maven/ws/zookeeper-server/src/main/java/org/apache/zookeeper/cli/CliCommand.java>:83:
warning - @return tag has no arguments.
[WARNING] <https://builds.apache.org/job/PreCommit-ZOOKEEPER-github-pr-build-maven/ws/zookeeper-server/src/main/java/org/apache/zookeeper/cli/CliCommand.java>:91:
warning - @return tag has no arguments.
[WARNING] <https://builds.apache.org/job/PreCommit-ZOOKEEPER-github-pr-build-maven/ws/zookeeper-server/src/main/java/org/apache/zookeeper/cli/CliCommand.java>:116:
warning - @return tag has no arguments.
[INFO] Building jar: <https://builds.apache.org/job/PreCommit-ZOOKEEPER-github-pr-build-maven/ws/zookeeper-server/target/zookeeper-3.6.0-SNAPSHOT-javadoc.jar>
[INFO] 
[INFO] --- maven-dependency-plugin:3.1.1:copy-dependencies (copy-dependencies) @ zookeeper
---
[INFO] Downloading from central: https://repo.maven.apache.org/maven2/org/apache/maven/shared/maven-dependency-analyzer/1.10/maven-dependency-analyzer-1.10.pom
[INFO] Downloaded from central: https://repo.maven.apache.org/maven2/org/apache/maven/shared/maven-dependency-analyzer/1.10/maven-dependency-analyzer-1.10.pom
(6.7 kB at 122 kB/s)
[INFO] Downloading from central: https://repo.maven.apache.org/maven2/org/apache/maven/shared/maven-shared-components/31/maven-shared-components-31.pom
[INFO] Downloaded from central: https://repo.maven.apache.org/maven2/org/apache/maven/shared/maven-shared-components/31/maven-shared-components-31.pom
(5.1 kB at 465 kB/s)
[INFO] Downloading from central: https://repo.maven.apache.org/maven2/org/codehaus/plexus/plexus-utils/1.5.1/plexus-utils-1.5.1.pom
[INFO] Downloaded from central: https://repo.maven.apache.org/maven2/org/codehaus/plexus/plexus-utils/1.5.1/plexus-utils-1.5.1.pom
(2.3 kB at 209 kB/s)
[INFO] Downloading from central: https://repo.maven.apache.org/maven2/org/apache/maven/maven-model/2.0.5/maven-model-2.0.5.pom
[INFO] Downloaded from central: https://repo.maven.apache.org/maven2/org/apache/maven/maven-model/2.0.5/maven-model-2.0.5.pom
(2.7 kB at 227 kB/s)
[INFO] Downloading from central: https://repo.maven.apache.org/maven2/org/apache/maven/maven/2.0.5/maven-2.0.5.pom
[INFO] Downloaded from central: https://repo.maven.apache.org/maven2/org/apache/maven/maven/2.0.5/maven-2.0.5.pom
(5.7 kB at 519 kB/s)
[INFO] Downloading from central: https://repo.maven.apache.org/maven2/org/apache/maven/maven-artifact/2.0.5/maven-artifact-2.0.5.pom
[INFO] Downloaded from central: https://repo.maven.apache.org/maven2/org/apache/maven/maven-artifact/2.0.5/maven-artifact-2.0.5.pom
(727 B at 52 kB/s)
[INFO] Downloading from central: https://repo.maven.apache.org/maven2/org/apache/maven/shared/maven-dependency-tree/3.0.1/maven-dependency-tree-3.0.1.pom
[INFO] Downloaded from central: https://repo.maven.apache.org/maven2/org/apache/maven/shared/maven-dependency-tree/3.0.1/maven-dependency-tree-3.0.1.pom
(7.5 kB at 682 kB/s)
[INFO] Downloading from central: https://repo.maven.apache.org/maven2/org/codehaus/plexus/plexus-velocity/1.1.7/plexus-velocity-1.1.7.jar
[INFO] Downloading from central: https://repo.maven.apache.org/maven2/org/apache/maven/shared/maven-dependency-analyzer/1.10/maven-dependency-analyzer-1.10.jar
[INFO] Downloading from central: https://repo.maven.apache.org/maven2/org/apache/maven/shared/maven-dependency-tree/3.0.1/maven-dependency-tree-3.0.1.jar
[INFO] Downloading from central: https://repo.maven.apache.org/maven2/org/apache/maven/shared/maven-common-artifact-filters/3.0.1/maven-common-artifact-filters-3.0.1.jar
[INFO] Downloaded from central: https://repo.maven.apache.org/maven2/org/codehaus/plexus/plexus-velocity/1.1.7/plexus-velocity-1.1.7.jar
(7.7 kB at 479 kB/s)
[INFO] Downloaded from central: https://repo.maven.apache.org/maven2/org/apache/maven/shared/maven-dependency-analyzer/1.10/maven-dependency-analyzer-1.10.jar
(35 kB at 929 kB/s)
[INFO] Downloaded from central: https://repo.maven.apache.org/maven2/org/apache/maven/shared/maven-dependency-tree/3.0.1/maven-dependency-tree-3.0.1.jar
(37 kB at 940 kB/s)
[INFO] Downloaded from central: https://repo.maven.apache.org/maven2/org/apache/maven/shared/maven-common-artifact-filters/3.0.1/maven-common-artifact-filters-3.0.1.jar
(61 kB at 1.5 MB/s)
[INFO] Copying spotbugs-annotations-3.1.9.jar to <https://builds.apache.org/job/PreCommit-ZOOKEEPER-github-pr-build-maven/ws/zookeeper-server/target/lib/spotbugs-annotations-3.1.9.jar>
[INFO] Copying jsr305-3.0.2.jar to <https://builds.apache.org/job/PreCommit-ZOOKEEPER-github-pr-build-maven/ws/zookeeper-server/target/lib/jsr305-3.0.2.jar>
[INFO] Copying hamcrest-all-1.3.jar to <https://builds.apache.org/job/PreCommit-ZOOKEEPER-github-pr-build-maven/ws/zookeeper-server/target/lib/hamcrest-all-1.3.jar>
[INFO] Copying commons-collections-3.2.2.jar to <https://builds.apache.org/job/PreCommit-ZOOKEEPER-github-pr-build-maven/ws/zookeeper-server/target/lib/commons-collections-3.2.2.jar>
[INFO] Copying commons-lang-2.6.jar to <https://builds.apache.org/job/PreCommit-ZOOKEEPER-github-pr-build-maven/ws/zookeeper-server/target/lib/commons-lang-2.6.jar>
[INFO] Copying zookeeper-jute-3.6.0-SNAPSHOT.jar to <https://builds.apache.org/job/PreCommit-ZOOKEEPER-github-pr-build-maven/ws/zookeeper-server/target/lib/zookeeper-jute-3.6.0-SNAPSHOT.jar>
[INFO] Copying commons-cli-1.2.jar to <https://builds.apache.org/job/PreCommit-ZOOKEEPER-github-pr-build-maven/ws/zookeeper-server/target/lib/commons-cli-1.2.jar>
[INFO] Copying audience-annotations-0.5.0.jar to <https://builds.apache.org/job/PreCommit-ZOOKEEPER-github-pr-build-maven/ws/zookeeper-server/target/lib/audience-annotations-0.5.0.jar>
[INFO] Copying netty-all-4.1.36.Final.jar to <https://builds.apache.org/job/PreCommit-ZOOKEEPER-github-pr-build-maven/ws/zookeeper-server/target/lib/netty-all-4.1.36.Final.jar>
[INFO] Copying slf4j-api-1.7.25.jar to <https://builds.apache.org/job/PreCommit-ZOOKEEPER-github-pr-build-maven/ws/zookeeper-server/target/lib/slf4j-api-1.7.25.jar>
[INFO] Copying slf4j-log4j12-1.7.25.jar to <https://builds.apache.org/job/PreCommit-ZOOKEEPER-github-pr-build-maven/ws/zookeeper-server/target/lib/slf4j-log4j12-1.7.25.jar>
[INFO] Copying jetty-server-9.4.17.v20190418.jar to <https://builds.apache.org/job/PreCommit-ZOOKEEPER-github-pr-build-maven/ws/zookeeper-server/target/lib/jetty-server-9.4.17.v20190418.jar>
[INFO] Copying javax.servlet-api-3.1.0.jar to <https://builds.apache.org/job/PreCommit-ZOOKEEPER-github-pr-build-maven/ws/zookeeper-server/target/lib/javax.servlet-api-3.1.0.jar>
[INFO] Copying jetty-http-9.4.17.v20190418.jar to <https://builds.apache.org/job/PreCommit-ZOOKEEPER-github-pr-build-maven/ws/zookeeper-server/target/lib/jetty-http-9.4.17.v20190418.jar>
[INFO] Copying jetty-util-9.4.17.v20190418.jar to <https://builds.apache.org/job/PreCommit-ZOOKEEPER-github-pr-build-maven/ws/zookeeper-server/target/lib/jetty-util-9.4.17.v20190418.jar>
[INFO] Copying jetty-io-9.4.17.v20190418.jar to <https://builds.apache.org/job/PreCommit-ZOOKEEPER-github-pr-build-maven/ws/zookeeper-server/target/lib/jetty-io-9.4.17.v20190418.jar>
[INFO] Copying jetty-servlet-9.4.17.v20190418.jar to <https://builds.apache.org/job/PreCommit-ZOOKEEPER-github-pr-build-maven/ws/zookeeper-server/target/lib/jetty-servlet-9.4.17.v20190418.jar>
[INFO] Copying jetty-security-9.4.17.v20190418.jar to <https://builds.apache.org/job/PreCommit-ZOOKEEPER-github-pr-build-maven/ws/zookeeper-server/target/lib/jetty-security-9.4.17.v20190418.jar>
[INFO] Copying jackson-databind-2.9.9.jar to <https://builds.apache.org/job/PreCommit-ZOOKEEPER-github-pr-build-maven/ws/zookeeper-server/target/lib/jackson-databind-2.9.9.jar>
[INFO] Copying jackson-annotations-2.9.0.jar to <https://builds.apache.org/job/PreCommit-ZOOKEEPER-github-pr-build-maven/ws/zookeeper-server/target/lib/jackson-annotations-2.9.0.jar>
[INFO] Copying jackson-core-2.9.9.jar to <https://builds.apache.org/job/PreCommit-ZOOKEEPER-github-pr-build-maven/ws/zookeeper-server/target/lib/jackson-core-2.9.9.jar>
[INFO] Copying json-simple-1.1.1.jar to <https://builds.apache.org/job/PreCommit-ZOOKEEPER-github-pr-build-maven/ws/zookeeper-server/target/lib/json-simple-1.1.1.jar>
[INFO] Copying bcprov-jdk15on-1.60.jar to <https://builds.apache.org/job/PreCommit-ZOOKEEPER-github-pr-build-maven/ws/zookeeper-server/target/lib/bcprov-jdk15on-1.60.jar>
[INFO] Copying bcpkix-jdk15on-1.60.jar to <https://builds.apache.org/job/PreCommit-ZOOKEEPER-github-pr-build-maven/ws/zookeeper-server/target/lib/bcpkix-jdk15on-1.60.jar>
[INFO] Copying jline-2.11.jar to <https://builds.apache.org/job/PreCommit-ZOOKEEPER-github-pr-build-maven/ws/zookeeper-server/target/lib/jline-2.11.jar>
[INFO] Copying metrics-core-3.2.5.jar to <https://builds.apache.org/job/PreCommit-ZOOKEEPER-github-pr-build-maven/ws/zookeeper-server/target/lib/metrics-core-3.2.5.jar>
[INFO] Copying log4j-1.2.17.jar to <https://builds.apache.org/job/PreCommit-ZOOKEEPER-github-pr-build-maven/ws/zookeeper-server/target/lib/log4j-1.2.17.jar>
[INFO] Copying kerb-core-1.1.0.jar to <https://builds.apache.org/job/PreCommit-ZOOKEEPER-github-pr-build-maven/ws/zookeeper-server/target/lib/kerb-core-1.1.0.jar>
[INFO] Copying kerby-pkix-1.1.0.jar to <https://builds.apache.org/job/PreCommit-ZOOKEEPER-github-pr-build-maven/ws/zookeeper-server/target/lib/kerby-pkix-1.1.0.jar>
[INFO] Copying kerby-asn1-1.1.0.jar to <https://builds.apache.org/job/PreCommit-ZOOKEEPER-github-pr-build-maven/ws/zookeeper-server/target/lib/kerby-asn1-1.1.0.jar>
[INFO] Copying kerby-util-1.1.0.jar to <https://builds.apache.org/job/PreCommit-ZOOKEEPER-github-pr-build-maven/ws/zookeeper-server/target/lib/kerby-util-1.1.0.jar>
[INFO] Copying kerb-simplekdc-1.1.0.jar to <https://builds.apache.org/job/PreCommit-ZOOKEEPER-github-pr-build-maven/ws/zookeeper-server/target/lib/kerb-simplekdc-1.1.0.jar>
[INFO] Copying kerb-client-1.1.0.jar to <https://builds.apache.org/job/PreCommit-ZOOKEEPER-github-pr-build-maven/ws/zookeeper-server/target/lib/kerb-client-1.1.0.jar>
[INFO] Copying kerb-common-1.1.0.jar to <https://builds.apache.org/job/PreCommit-ZOOKEEPER-github-pr-build-maven/ws/zookeeper-server/target/lib/kerb-common-1.1.0.jar>
[INFO] Copying kerb-crypto-1.1.0.jar to <https://builds.apache.org/job/PreCommit-ZOOKEEPER-github-pr-build-maven/ws/zookeeper-server/target/lib/kerb-crypto-1.1.0.jar>
[INFO] Copying commons-io-2.6.jar to <https://builds.apache.org/job/PreCommit-ZOOKEEPER-github-pr-build-maven/ws/zookeeper-server/target/lib/commons-io-2.6.jar>
[INFO] Copying kerb-util-1.1.0.jar to <https://builds.apache.org/job/PreCommit-ZOOKEEPER-github-pr-build-maven/ws/zookeeper-server/target/lib/kerb-util-1.1.0.jar>
[INFO] Copying token-provider-1.1.0.jar to <https://builds.apache.org/job/PreCommit-ZOOKEEPER-github-pr-build-maven/ws/zookeeper-server/target/lib/token-provider-1.1.0.jar>
[INFO] Copying nimbus-jose-jwt-4.41.2.jar to <https://builds.apache.org/job/PreCommit-ZOOKEEPER-github-pr-build-maven/ws/zookeeper-server/target/lib/nimbus-jose-jwt-4.41.2.jar>
[INFO] Copying jcip-annotations-1.0-1.jar to <https://builds.apache.org/job/PreCommit-ZOOKEEPER-github-pr-build-maven/ws/zookeeper-server/target/lib/jcip-annotations-1.0-1.jar>
[INFO] Copying json-smart-2.3.jar to <https://builds.apache.org/job/PreCommit-ZOOKEEPER-github-pr-build-maven/ws/zookeeper-server/target/lib/json-smart-2.3.jar>
[INFO] Copying accessors-smart-1.2.jar to <https://builds.apache.org/job/PreCommit-ZOOKEEPER-github-pr-build-maven/ws/zookeeper-server/target/lib/accessors-smart-1.2.jar>
[INFO] Copying asm-5.0.4.jar to <https://builds.apache.org/job/PreCommit-ZOOKEEPER-github-pr-build-maven/ws/zookeeper-server/target/lib/asm-5.0.4.jar>
[INFO] Copying kerb-admin-1.1.0.jar to <https://builds.apache.org/job/PreCommit-ZOOKEEPER-github-pr-build-maven/ws/zookeeper-server/target/lib/kerb-admin-1.1.0.jar>
[INFO] Copying kerb-server-1.1.0.jar to <https://builds.apache.org/job/PreCommit-ZOOKEEPER-github-pr-build-maven/ws/zookeeper-server/target/lib/kerb-server-1.1.0.jar>
[INFO] Copying kerb-identity-1.1.0.jar to <https://builds.apache.org/job/PreCommit-ZOOKEEPER-github-pr-build-maven/ws/zookeeper-server/target/lib/kerb-identity-1.1.0.jar>
[INFO] Copying kerby-xdr-1.1.0.jar to <https://builds.apache.org/job/PreCommit-ZOOKEEPER-github-pr-build-maven/ws/zookeeper-server/target/lib/kerby-xdr-1.1.0.jar>
[INFO] Copying kerby-config-1.1.0.jar to <https://builds.apache.org/job/PreCommit-ZOOKEEPER-github-pr-build-maven/ws/zookeeper-server/target/lib/kerby-config-1.1.0.jar>
[INFO] Copying mockito-core-2.27.0.jar to <https://builds.apache.org/job/PreCommit-ZOOKEEPER-github-pr-build-maven/ws/zookeeper-server/target/lib/mockito-core-2.27.0.jar>
[INFO] Copying byte-buddy-1.9.10.jar to <https://builds.apache.org/job/PreCommit-ZOOKEEPER-github-pr-build-maven/ws/zookeeper-server/target/lib/byte-buddy-1.9.10.jar>
[INFO] Copying byte-buddy-agent-1.9.10.jar to <https://builds.apache.org/job/PreCommit-ZOOKEEPER-github-pr-build-maven/ws/zookeeper-server/target/lib/byte-buddy-agent-1.9.10.jar>
[INFO] Copying objenesis-2.6.jar to <https://builds.apache.org/job/PreCommit-ZOOKEEPER-github-pr-build-maven/ws/zookeeper-server/target/lib/objenesis-2.6.jar>
[INFO] Copying junit-4.12.jar to <https://builds.apache.org/job/PreCommit-ZOOKEEPER-github-pr-build-maven/ws/zookeeper-server/target/lib/junit-4.12.jar>
[INFO] Copying hamcrest-core-1.3.jar to <https://builds.apache.org/job/PreCommit-ZOOKEEPER-github-pr-build-maven/ws/zookeeper-server/target/lib/hamcrest-core-1.3.jar>
[INFO] Copying snappy-java-1.1.7.jar to <https://builds.apache.org/job/PreCommit-ZOOKEEPER-github-pr-build-maven/ws/zookeeper-server/target/lib/snappy-java-1.1.7.jar>
[INFO] 
[INFO] --- checksum-maven-plugin:1.8:artifacts (default) @ zookeeper ---
[INFO] zookeeper-3.6.0-SNAPSHOT.jar - SHA-512 : c1b78a4fd534a633efc56e1efc2f0e2a38ce91a241702af75519974c20faac59e6530511a566a094f13cf3d6a443db424d0d4a2bf900214fb10b3258c042e280
[INFO] zookeeper-3.6.0-SNAPSHOT-tests.jar - SHA-512 : 0f92a1a8a99228579d8a84cfa540a038567b49bbe2bff566f4ad667466b9f74ca6035fd7172a96f4ac8aa9fd664663445c42e32bca6dc5187e601ac67b90ab19
[INFO] zookeeper-3.6.0-SNAPSHOT-sources.jar - SHA-512 : 85bcd54fd4da5e01cf14aa43785baf490ddecd7cb7c0a8cfbd14e4ea7b4837e29bde14426e45b3535eff46748ae8949bc35fe5c12b351ab8460a0b2da236f313
[INFO] zookeeper-3.6.0-SNAPSHOT-javadoc.jar - SHA-512 : 5eccaf5eb5927279e2c58a74f8e601c0224f69e1624a5bc88449771835825df7af094c6c64085c281e1c5c9407e9848195ffabe8fe267aabbb6cc9fac102456d
[INFO] 
[INFO] >>> spotbugs-maven-plugin:3.1.9:check (default-cli) > :spotbugs @ zookeeper
>>>
[INFO] 
[INFO] --- spotbugs-maven-plugin:3.1.9:spotbugs (spotbugs) @ zookeeper ---
[INFO] Fork Value is true
     [java] SLF4J: No SLF4J providers were found.
     [java] SLF4J: Defaulting to no-operation (NOP) logger implementation
     [java] SLF4J: See http://www.slf4j.org/codes.html#noProviders for further details.
     [java] Warnings generated: 1
[INFO] Done SpotBugs Analysis....
[INFO] 
[INFO] <<< spotbugs-maven-plugin:3.1.9:check (default-cli) < :spotbugs @ zookeeper
<<<
[INFO] 
[INFO] 
[INFO] --- spotbugs-maven-plugin:3.1.9:check (default-cli) @ zookeeper ---
[INFO] BugInstance size is 1
[INFO] Error size is 0
[INFO] Total bugs: 1
[ERROR] Inconsistent synchronization of org.apache.zookeeper.server.DataNode.data; locked
96% of time [org.apache.zookeeper.server.PrepRequestProcessor, org.apache.zookeeper.server.DataNode,
org.apache.zookeeper.server.DataNode, org.apache.zookeeper.server.DataNode, org.apache.zookeeper.server.DataNode,
org.apache.zookeeper.server.DataTree, org.apache.zookeeper.server.DataTree, org.apache.zookeeper.server.DataTree,
org.apache.zookeeper.server.DataTree, org.apache.zookeeper.server.DataTree, org.apache.zookeeper.server.DataTree,
org.apache.zookeeper.server.DataTree, org.apache.zookeeper.server.DataTree, org.apache.zookeeper.server.DataTree,
org.apache.zookeeper.server.DataTree, org.apache.zookeeper.server.DataTree, org.apache.zookeeper.server.DataTree,
org.apache.zookeeper.server.DataTree, org.apache.zookeeper.server.DataTree, org.apache.zookeeper.server.PrepRequestProcessor,
org.apache.zookeeper.server.PrepRequestProcessor, org.apache.zookeeper.server.SnapshotFormatter,
org.apache.zookeeper.server.SnapshotFormatter, org.apache.zookeeper.server.SnapshotFormatter,
org.apache.zookeeper.server.SnapshotFormatter, org.apache.zookeeper.server.SnapshotFormatter,
org.apache.zookeeper.server.SnapshotFormatter] Unsynchronized access at PrepRequestProcessor.java:[line
522]Synchronized access at DataNode.java:[line 180]Synchronized access at DataNode.java:[line
170]Synchronized access at DataNode.java:[line 147]Synchronized access at DataNode.java:[line
147]Synchronized access at DataTree.java:[line 1150]Synchronized access at DataTree.java:[line
217]Synchronized access at DataTree.java:[line 618]Synchronized access at DataTree.java:[line
619]Synchronized access at DataTree.java:[line 1222]Synchronized access at DataTree.java:[line
466]Synchronized access at DataTree.java:[line 362]Synchronized access at DataTree.java:[line
366]Synchronized access at DataTree.java:[line 554]Synchronized access at DataTree.java:[line
589]Synchronized access at DataTree.java:[line 589]Synchronized access at DataTree.java:[line
1120]Synchronized access at DataTree.java:[line 1120]Synchronized access at DataTree.java:[line
673]Synchronized access at PrepRequestProcessor.java:[line 327]Synchronized access at PrepRequestProcessor.java:[line
348]Synchronized access at SnapshotFormatter.java:[line 153]Synchronized access at SnapshotFormatter.java:[line
150]Synchronized access at SnapshotFormatter.java:[line 153]Synchronized access at SnapshotFormatter.java:[line
151]Synchronized access at SnapshotFormatter.java:[line 219]Synchronized access at SnapshotFormatter.java:[line
219] IS2_INCONSISTENT_SYNC
[INFO] 


To see bug detail using the Spotbugs GUI, use the following command "mvn spotbugs:gui"



[INFO] ------------------------------------------------------------------------
[INFO] Reactor Summary for Apache ZooKeeper 3.6.0-SNAPSHOT:
[INFO] 
[INFO] Apache ZooKeeper ................................... SUCCESS [ 47.852 s]
[INFO] Apache ZooKeeper - Documentation ................... SUCCESS [ 12.615 s]
[INFO] Apache ZooKeeper - Jute ............................ SUCCESS [01:20 min]
[INFO] Apache ZooKeeper - Server .......................... FAILURE [26:23 min]
[INFO] Apache ZooKeeper - Metrics Providers ............... SKIPPED
[INFO] Apache ZooKeeper - Prometheus.io Metrics Provider .. SKIPPED
[INFO] Apache ZooKeeper - Client .......................... SKIPPED
[INFO] Apache ZooKeeper - Client - C ...................... SKIPPED
[INFO] Apache ZooKeeper - Recipes ......................... SKIPPED
[INFO] Apache ZooKeeper - Recipes - Election .............. SKIPPED
[INFO] Apache ZooKeeper - Recipes - Lock .................. SKIPPED
[INFO] Apache ZooKeeper - Recipes - Queue ................. SKIPPED
[INFO] Apache ZooKeeper - Assembly ........................ SKIPPED
[INFO] Apache ZooKeeper - Contrib ......................... SKIPPED
[INFO] Apache ZooKeeper - Contrib - Loggraph .............. SKIPPED
[INFO] Apache ZooKeeper - Contrib - Rest .................. SKIPPED
[INFO] Apache ZooKeeper - Contrib - ZooInspector .......... SKIPPED
[INFO] ------------------------------------------------------------------------
[INFO] BUILD FAILURE
[INFO] ------------------------------------------------------------------------
[INFO] Total time:  29:26 min
[INFO] Finished at: 2019-06-22T07:41:11Z
[INFO] ------------------------------------------------------------------------
Waiting for Jenkins to finish collecting data
[ERROR] Failed to execute goal com.github.spotbugs:spotbugs-maven-plugin:3.1.9:check (default-cli)
on project zookeeper: failed with 1 bugs and 0 errors -> [Help 1]
[ERROR] 
[ERROR] To see the full stack trace of the errors, re-run Maven with the -e switch.
[ERROR] Re-run Maven using the -X switch to enable full debug logging.
[ERROR] 
[ERROR] For more information about the errors and possible solutions, please read the following
articles:
[ERROR] [Help 1] http://cwiki.apache.org/confluence/display/MAVEN/MojoExecutionException
[ERROR] 
[ERROR] After correcting the problems, you can resume the build with the command
[ERROR]   mvn <goals> -rf :zookeeper
[JENKINS] Archiving <https://builds.apache.org/job/PreCommit-ZOOKEEPER-github-pr-build-maven/ws/zookeeper-server/pom.xml>
to org.apache.zookeeper/zookeeper/3.6.0-SNAPSHOT/zookeeper-3.6.0-SNAPSHOT.pom
[JENKINS] Archiving <https://builds.apache.org/job/PreCommit-ZOOKEEPER-github-pr-build-maven/ws/zookeeper-server/target/zookeeper-3.6.0-SNAPSHOT.jar>
to org.apache.zookeeper/zookeeper/3.6.0-SNAPSHOT/zookeeper-3.6.0-SNAPSHOT.jar
[JENKINS] Archiving <https://builds.apache.org/job/PreCommit-ZOOKEEPER-github-pr-build-maven/ws/zookeeper-server/target/zookeeper-3.6.0-SNAPSHOT-tests.jar>
to org.apache.zookeeper/zookeeper/3.6.0-SNAPSHOT/zookeeper-3.6.0-SNAPSHOT-tests.jar
[JENKINS] Archiving <https://builds.apache.org/job/PreCommit-ZOOKEEPER-github-pr-build-maven/ws/zookeeper-server/target/zookeeper-3.6.0-SNAPSHOT-sources.jar>
to org.apache.zookeeper/zookeeper/3.6.0-SNAPSHOT/zookeeper-3.6.0-SNAPSHOT-sources.jar
[JENKINS] Archiving <https://builds.apache.org/job/PreCommit-ZOOKEEPER-github-pr-build-maven/ws/zookeeper-server/target/zookeeper-3.6.0-SNAPSHOT-javadoc.jar>
to org.apache.zookeeper/zookeeper/3.6.0-SNAPSHOT/zookeeper-3.6.0-SNAPSHOT-javadoc.jar
[JENKINS] Archiving <https://builds.apache.org/job/PreCommit-ZOOKEEPER-github-pr-build-maven/ws/zookeeper-contrib/zookeeper-contrib-loggraph/pom.xml>
to org.apache.zookeeper/zookeeper-contrib-loggraph/3.6.0-SNAPSHOT/zookeeper-contrib-loggraph-3.6.0-SNAPSHOT.pom
[JENKINS] Archiving <https://builds.apache.org/job/PreCommit-ZOOKEEPER-github-pr-build-maven/ws/zookeeper-metrics-providers/pom.xml>
to org.apache.zookeeper/zookeeper-metrics-providers/3.6.0-SNAPSHOT/zookeeper-metrics-providers-3.6.0-SNAPSHOT.pom
[JENKINS] Archiving <https://builds.apache.org/job/PreCommit-ZOOKEEPER-github-pr-build-maven/ws/zookeeper-metrics-providers/zookeeper-prometheus-metrics/pom.xml>
to org.apache.zookeeper/zookeeper-prometheus-metrics/3.6.0-SNAPSHOT/zookeeper-prometheus-metrics-3.6.0-SNAPSHOT.pom
[JENKINS] Archiving <https://builds.apache.org/job/PreCommit-ZOOKEEPER-github-pr-build-maven/ws/zookeeper-recipes/zookeeper-recipes-election/pom.xml>
to org.apache.zookeeper/zookeeper-recipes-election/3.6.0-SNAPSHOT/zookeeper-recipes-election-3.6.0-SNAPSHOT.pom
[JENKINS] Archiving <https://builds.apache.org/job/PreCommit-ZOOKEEPER-github-pr-build-maven/ws/pom.xml>
to org.apache.zookeeper/parent/3.6.0-SNAPSHOT/parent-3.6.0-SNAPSHOT.pom
[JENKINS] Archiving <https://builds.apache.org/job/PreCommit-ZOOKEEPER-github-pr-build-maven/ws/zookeeper-recipes/zookeeper-recipes-lock/pom.xml>
to org.apache.zookeeper/zookeeper-recipes-lock/3.6.0-SNAPSHOT/zookeeper-recipes-lock-3.6.0-SNAPSHOT.pom
[JENKINS] Archiving <https://builds.apache.org/job/PreCommit-ZOOKEEPER-github-pr-build-maven/ws/zookeeper-contrib/pom.xml>
to org.apache.zookeeper/zookeeper-contrib/3.6.0-SNAPSHOT/zookeeper-contrib-3.6.0-SNAPSHOT.pom
[JENKINS] Archiving <https://builds.apache.org/job/PreCommit-ZOOKEEPER-github-pr-build-maven/ws/zookeeper-client/pom.xml>
to org.apache.zookeeper/zookeeper-client/3.6.0-SNAPSHOT/zookeeper-client-3.6.0-SNAPSHOT.pom
[JENKINS] Archiving <https://builds.apache.org/job/PreCommit-ZOOKEEPER-github-pr-build-maven/ws/zookeeper-jute/pom.xml>
to org.apache.zookeeper/zookeeper-jute/3.6.0-SNAPSHOT/zookeeper-jute-3.6.0-SNAPSHOT.pom
[JENKINS] Archiving <https://builds.apache.org/job/PreCommit-ZOOKEEPER-github-pr-build-maven/ws/zookeeper-jute/target/zookeeper-jute-3.6.0-SNAPSHOT.jar>
to org.apache.zookeeper/zookeeper-jute/3.6.0-SNAPSHOT/zookeeper-jute-3.6.0-SNAPSHOT.jar
[JENKINS] Archiving <https://builds.apache.org/job/PreCommit-ZOOKEEPER-github-pr-build-maven/ws/zookeeper-jute/target/zookeeper-jute-3.6.0-SNAPSHOT-tests.jar>
to org.apache.zookeeper/zookeeper-jute/3.6.0-SNAPSHOT/zookeeper-jute-3.6.0-SNAPSHOT-tests.jar
[JENKINS] Archiving <https://builds.apache.org/job/PreCommit-ZOOKEEPER-github-pr-build-maven/ws/zookeeper-jute/target/zookeeper-jute-3.6.0-SNAPSHOT-sources.jar>
to org.apache.zookeeper/zookeeper-jute/3.6.0-SNAPSHOT/zookeeper-jute-3.6.0-SNAPSHOT-sources.jar
[JENKINS] Archiving <https://builds.apache.org/job/PreCommit-ZOOKEEPER-github-pr-build-maven/ws/zookeeper-jute/target/zookeeper-jute-3.6.0-SNAPSHOT-javadoc.jar>
to org.apache.zookeeper/zookeeper-jute/3.6.0-SNAPSHOT/zookeeper-jute-3.6.0-SNAPSHOT-javadoc.jar
[JENKINS] Archiving <https://builds.apache.org/job/PreCommit-ZOOKEEPER-github-pr-build-maven/ws/zookeeper-recipes/zookeeper-recipes-queue/pom.xml>
to org.apache.zookeeper/zookeeper-recipes-queue/3.6.0-SNAPSHOT/zookeeper-recipes-queue-3.6.0-SNAPSHOT.pom
[JENKINS] Archiving <https://builds.apache.org/job/PreCommit-ZOOKEEPER-github-pr-build-maven/ws/zookeeper-docs/pom.xml>
to org.apache.zookeeper/zookeeper-docs/3.6.0-SNAPSHOT/zookeeper-docs-3.6.0-SNAPSHOT.pom
[JENKINS] Archiving <https://builds.apache.org/job/PreCommit-ZOOKEEPER-github-pr-build-maven/ws/zookeeper-docs/target/zookeeper-docs-3.6.0-SNAPSHOT.jar>
to org.apache.zookeeper/zookeeper-docs/3.6.0-SNAPSHOT/zookeeper-docs-3.6.0-SNAPSHOT.jar
[JENKINS] Archiving <https://builds.apache.org/job/PreCommit-ZOOKEEPER-github-pr-build-maven/ws/zookeeper-docs/target/zookeeper-docs-3.6.0-SNAPSHOT-tests.jar>
to org.apache.zookeeper/zookeeper-docs/3.6.0-SNAPSHOT/zookeeper-docs-3.6.0-SNAPSHOT-tests.jar
[JENKINS] Archiving <https://builds.apache.org/job/PreCommit-ZOOKEEPER-github-pr-build-maven/ws/zookeeper-docs/target/zookeeper-docs-3.6.0-SNAPSHOT-sources.jar>
to org.apache.zookeeper/zookeeper-docs/3.6.0-SNAPSHOT/zookeeper-docs-3.6.0-SNAPSHOT-sources.jar
[JENKINS] Archiving <https://builds.apache.org/job/PreCommit-ZOOKEEPER-github-pr-build-maven/ws/zookeeper-recipes/pom.xml>
to org.apache.zookeeper/zookeeper-recipes/3.6.0-SNAPSHOT/zookeeper-recipes-3.6.0-SNAPSHOT.pom
[JENKINS] Archiving <https://builds.apache.org/job/PreCommit-ZOOKEEPER-github-pr-build-maven/ws/zookeeper-client/zookeeper-client-c/pom.xml>
to org.apache.zookeeper/zookeeper-client-c/3.6.0-SNAPSHOT/zookeeper-client-c-3.6.0-SNAPSHOT.pom
[JENKINS] Archiving <https://builds.apache.org/job/PreCommit-ZOOKEEPER-github-pr-build-maven/ws/zookeeper-contrib/zookeeper-contrib-rest/pom.xml>
to org.apache.zookeeper/zookeeper-contrib-rest/3.6.0-SNAPSHOT/zookeeper-contrib-rest-3.6.0-SNAPSHOT.pom
[JENKINS] Archiving <https://builds.apache.org/job/PreCommit-ZOOKEEPER-github-pr-build-maven/ws/zookeeper-assembly/pom.xml>
to org.apache.zookeeper/zookeeper-assembly/3.6.0-SNAPSHOT/zookeeper-assembly-3.6.0-SNAPSHOT.pom
[JENKINS] Archiving <https://builds.apache.org/job/PreCommit-ZOOKEEPER-github-pr-build-maven/ws/zookeeper-contrib/zookeeper-contrib-zooinspector/pom.xml>
to org.apache.zookeeper/zookeeper-contrib-zooinspector/3.6.0-SNAPSHOT/zookeeper-contrib-zooinspector-3.6.0-SNAPSHOT.pom
channel stopped
[SpotBugs] Skipping execution of recorder since overall result is 'FAILURE'
Setting status of fe7d72172ccfebef78101374937b748afd510e5c to FAILURE with url https://builds.apache.org/job/PreCommit-ZOOKEEPER-github-pr-build-maven/851/
and message: 'FAILURE
 '
Using context: JenkinsMaven

Mime
View raw message