zookeeper-dev mailing list archives

Site index · List index
Message view « Date » · « Thread »
Top « Date » · « Thread »
From Apache Jenkins Server <jenk...@builds.apache.org>
Subject ZooKeeper_branch34_jdk7 - Build # 2349 - Failure
Date Thu, 06 Jun 2019 06:50:11 GMT
See https://builds.apache.org/job/ZooKeeper_branch34_jdk7/2349/

###################################################################################
########################## LAST 60 LINES OF THE CONSOLE ###########################
[...truncated 46.93 KB...]
    [junit] Running org.apache.zookeeper.test.RestoreCommittedLogTest
    [junit] Tests run: 1, Failures: 0, Errors: 0, Skipped: 0, Time elapsed: 20.001 sec
    [junit] Running org.apache.zookeeper.test.SaslAuthDesignatedClientTest
    [junit] Tests run: 2, Failures: 0, Errors: 0, Skipped: 0, Time elapsed: 1.669 sec
    [junit] Running org.apache.zookeeper.test.SaslAuthDesignatedServerTest
    [junit] Tests run: 1, Failures: 0, Errors: 0, Skipped: 0, Time elapsed: 0.623 sec
    [junit] Running org.apache.zookeeper.test.SaslAuthFailDesignatedClientTest
    [junit] Tests run: 1, Failures: 0, Errors: 0, Skipped: 0, Time elapsed: 1.554 sec
    [junit] Running org.apache.zookeeper.test.SaslAuthFailNotifyTest
    [junit] Tests run: 1, Failures: 0, Errors: 0, Skipped: 0, Time elapsed: 0.501 sec
    [junit] Running org.apache.zookeeper.test.SaslAuthFailTest
    [junit] Tests run: 1, Failures: 0, Errors: 0, Skipped: 0, Time elapsed: 0.611 sec
    [junit] Running org.apache.zookeeper.test.SaslAuthMissingClientConfigTest
    [junit] Tests run: 1, Failures: 0, Errors: 0, Skipped: 0, Time elapsed: 0.574 sec
    [junit] Running org.apache.zookeeper.test.SaslClientTest
    [junit] Tests run: 1, Failures: 0, Errors: 0, Skipped: 0, Time elapsed: 0.08 sec
    [junit] Running org.apache.zookeeper.test.SessionInvalidationTest
    [junit] Tests run: 1, Failures: 0, Errors: 0, Skipped: 0, Time elapsed: 0.674 sec
    [junit] Running org.apache.zookeeper.test.SessionTest
    [junit] Tests run: 5, Failures: 0, Errors: 0, Skipped: 0, Time elapsed: 11.748 sec
    [junit] Running org.apache.zookeeper.test.SessionTimeoutTest
    [junit] Tests run: 4, Failures: 0, Errors: 0, Skipped: 0, Time elapsed: 0.926 sec
    [junit] Running org.apache.zookeeper.test.StandaloneTest
    [junit] Tests run: 1, Failures: 0, Errors: 0, Skipped: 0, Time elapsed: 0.866 sec
    [junit] Running org.apache.zookeeper.test.StatTest
    [junit] Tests run: 4, Failures: 0, Errors: 0, Skipped: 0, Time elapsed: 1.122 sec
    [junit] Running org.apache.zookeeper.test.StaticHostProviderTest
    [junit] Tests run: 13, Failures: 0, Errors: 0, Skipped: 0, Time elapsed: 1.808 sec
    [junit] Running org.apache.zookeeper.test.SyncCallTest
    [junit] Tests run: 1, Failures: 0, Errors: 0, Skipped: 0, Time elapsed: 0.609 sec
    [junit] Running org.apache.zookeeper.test.TruncateTest
    [junit] Tests run: 3, Failures: 0, Errors: 0, Skipped: 0, Time elapsed: 8.43 sec
    [junit] Running org.apache.zookeeper.test.UpgradeTest
    [junit] Tests run: 1, Failures: 0, Errors: 0, Skipped: 0, Time elapsed: 1.435 sec
    [junit] Running org.apache.zookeeper.test.WatchedEventTest
    [junit] Tests run: 4, Failures: 0, Errors: 0, Skipped: 0, Time elapsed: 0.095 sec
    [junit] Running org.apache.zookeeper.test.WatcherFuncTest
    [junit] Tests run: 6, Failures: 0, Errors: 0, Skipped: 0, Time elapsed: 1.456 sec
    [junit] Running org.apache.zookeeper.test.WatcherTest
    [junit] Tests run: 7, Failures: 0, Errors: 0, Skipped: 0, Time elapsed: 29.713 sec
    [junit] Running org.apache.zookeeper.test.ZkDatabaseCorruptionTest
    [junit] Tests run: 1, Failures: 0, Errors: 0, Skipped: 0, Time elapsed: 8.938 sec
    [junit] Running org.apache.zookeeper.test.ZooKeeperQuotaTest
    [junit] Tests run: 1, Failures: 0, Errors: 0, Skipped: 0, Time elapsed: 0.662 sec
    [junit] Running org.apache.jute.BinaryInputArchiveTest
    [junit] Tests run: 1, Failures: 0, Errors: 0, Skipped: 0, Time elapsed: 0.079 sec

fail.build.on.test.failure:

BUILD FAILED
/home/jenkins/jenkins-slave/workspace/ZooKeeper_branch34_jdk7/build.xml:1425: The following
error occurred while executing this line:
/home/jenkins/jenkins-slave/workspace/ZooKeeper_branch34_jdk7/build.xml:1428: Tests failed!

Total time: 42 minutes 3 seconds
Build step 'Invoke Ant' marked build as failure
Archiving artifacts
Recording test results
Email was triggered for: Failure - Any
Sending email for trigger: Failure - Any



###################################################################################
############################## FAILED TESTS (if any) ##############################
1 tests failed.
FAILED:  org.apache.zookeeper.test.QuorumTest.testLeaderShutdown

Error Message:
Forked Java VM exited abnormally. Please note the time in the report does not reflect the
time until the VM exit.

Stack Trace:
junit.framework.AssertionFailedError: Forked Java VM exited abnormally. Please note the time
in the report does not reflect the time until the VM exit.
Mime
  • Unnamed multipart/mixed (inline, None, 0 bytes)
View raw message