zookeeper-dev mailing list archives

Site index · List index
Message view « Date » · « Thread »
Top « Date » · « Thread »
From Apache Jenkins Server <jenk...@builds.apache.org>
Subject Build failed in Jenkins: ZooKeeper-trunk-owasp #404
Date Sat, 22 Jun 2019 09:24:56 GMT
See <https://builds.apache.org/job/ZooKeeper-trunk-owasp/404/display/redirect>

------------------------------------------
[...truncated 20.76 KB...]
    [javac] warning: [options] bootstrap class path not set in conjunction with -source 8
    [javac] 1 warning

compile:
    [javac] Compiling 316 source files to <https://builds.apache.org/job/ZooKeeper-trunk-owasp/ws/build/classes>
    [javac] warning: [options] bootstrap class path not set in conjunction with -source 8
    [javac] <https://builds.apache.org/job/ZooKeeper-trunk-owasp/ws/zookeeper-server/src/main/java/org/apache/zookeeper/server/NIOServerCnxn.java>:247:
warning: [cast] redundant cast to ByteBuffer
    [javac]                     b = (ByteBuffer) b.slice().limit(
    [javac]                         ^
    [javac] <https://builds.apache.org/job/ZooKeeper-trunk-owasp/ws/zookeeper-server/src/main/java/org/apache/zookeeper/server/persistence/FilePadding.java>:78:
warning: [cast] redundant cast to ByteBuffer
    [javac]             fileChannel.write((ByteBuffer) fill.position(0), newFileSize - fill.remaining());
    [javac]                               ^
    [javac] 3 warnings

compile-test:
    [mkdir] Created dir: <https://builds.apache.org/job/ZooKeeper-trunk-owasp/ws/build/test/classes>
    [javac] Compiling 288 source files to <https://builds.apache.org/job/ZooKeeper-trunk-owasp/ws/build/test/classes>
    [javac] warning: [options] bootstrap class path not set in conjunction with -source 8
    [javac] 1 warning
    [javac] Compiling 11 source files to <https://builds.apache.org/job/ZooKeeper-trunk-owasp/ws/build/test/classes>
    [javac] warning: [options] bootstrap class path not set in conjunction with -source 8
    [javac] Note: Some input files use or override a deprecated API.
    [javac] Note: Recompile with -Xlint:deprecation for details.
    [javac] 1 warning
    [javac] Compiling 2 source files to <https://builds.apache.org/job/ZooKeeper-trunk-owasp/ws/build/test/classes>
    [javac] warning: [options] bootstrap class path not set in conjunction with -source 8
    [javac] Note: <https://builds.apache.org/job/ZooKeeper-trunk-owasp/ws/zookeeper-it/src/test/bench/org/apache/zookeeper/server/watch/WatchBench.java>
uses or overrides a deprecated API.
    [javac] Note: Recompile with -Xlint:deprecation for details.
    [javac] 1 warning

init:

ivy-download:

ivy-taskdef:

ivy-init:

ivy-retrieve-owasp:
[ivy:retrieve] :: loading settings :: file = <https://builds.apache.org/job/ZooKeeper-trunk-owasp/ws/ivysettings.xml>
[ivy:retrieve] :: resolving dependencies :: org.apache.zookeeper#zookeeper;3.6.0-SNAPSHOT
[ivy:retrieve] 	confs: [owasp]
[ivy:retrieve] 	found org.owasp#dependency-check-ant;4.0.2 in maven2
[ivy:retrieve] 	found org.owasp#dependency-check-core;4.0.2 in maven2
[ivy:retrieve] 	found com.vdurmont#semver4j;2.2.0 in maven2
[ivy:retrieve] 	found joda-time#joda-time;1.6 in maven2
[ivy:retrieve] 	found org.slf4j#slf4j-api;1.7.25 in maven2
[ivy:retrieve] 	found org.owasp#dependency-check-utils;4.0.2 in maven2
[ivy:retrieve] 	found commons-io#commons-io;2.6 in maven2
[ivy:retrieve] 	found org.apache.commons#commons-lang3;3.4 in maven2
[ivy:retrieve] 	found com.google.code.gson#gson;2.8.5 in maven2
[ivy:retrieve] 	found commons-collections#commons-collections;3.2.2 in maven2
[ivy:retrieve] 	found org.apache.commons#commons-compress;1.18 in maven2
[ivy:retrieve] 	found org.apache.commons#commons-text;1.3 in maven2
[ivy:retrieve] 	found org.apache.lucene#lucene-core;7.6.0 in maven2
[ivy:retrieve] 	found org.apache.lucene#lucene-analyzers-common;7.6.0 in maven2
[ivy:retrieve] 	found org.apache.lucene#lucene-queryparser;7.6.0 in maven2
[ivy:retrieve] 	found org.apache.lucene#lucene-queries;7.6.0 in maven2
[ivy:retrieve] 	found org.apache.lucene#lucene-sandbox;7.6.0 in maven2
[ivy:retrieve] 	found org.apache.velocity#velocity;1.7 in maven2
[ivy:retrieve] 	found commons-lang#commons-lang;2.4 in maven2
[ivy:retrieve] 	found org.glassfish#javax.json;1.0.4 in maven2
[ivy:retrieve] 	found org.jsoup#jsoup;1.11.3 in maven2
[ivy:retrieve] 	found com.sun.mail#mailapi;1.6.3 in maven2
[ivy:retrieve] 	found com.google.guava#guava;27.0.1-jre in maven2
[ivy:retrieve] 	found com.google.guava#failureaccess;1.0.1 in maven2
[ivy:retrieve] 	found com.google.guava#listenablefuture;9999.0-empty-to-avoid-conflict-with-guava
in maven2
[ivy:retrieve] 	found com.google.code.findbugs#jsr305;3.0.2 in maven2
[ivy:retrieve] 	found org.checkerframework#checker-qual;2.5.2 in maven2
[ivy:retrieve] 	found com.google.errorprone#error_prone_annotations;2.2.0 in maven2
[ivy:retrieve] 	found com.google.j2objc#j2objc-annotations;1.1 in maven2
[ivy:retrieve] 	found org.codehaus.mojo#animal-sniffer-annotations;1.17 in maven2
[ivy:retrieve] 	found com.h3xstream.retirejs#retirejs-core;3.0.1 in maven2
[ivy:retrieve] 	found org.json#json;20140107 in maven2
[ivy:retrieve] 	found com.esotericsoftware#minlog;1.3 in maven2
[ivy:retrieve] 	found com.github.spullara.mustache.java#compiler;0.8.17 in maven2
[ivy:retrieve] 	found com.h2database#h2;1.4.196 in maven2
[ivy:retrieve] :: resolution report :: resolve 1018ms :: artifacts dl 22ms
	---------------------------------------------------------------------
	|                  |            modules            ||   artifacts   |
	|       conf       | number| search|dwnlded|evicted|| number|dwnlded|
	---------------------------------------------------------------------
	|       owasp      |   35  |   0   |   0   |   0   ||   35  |   0   |
	---------------------------------------------------------------------
[ivy:retrieve] :: retrieving :: org.apache.zookeeper#zookeeper
[ivy:retrieve] 	confs: [owasp]
[ivy:retrieve] 	35 artifacts copied, 0 already retrieved (15405kB/264ms)

owasp-taskdef:

ivy-retrieve:
[ivy:retrieve] :: resolving dependencies :: org.apache.zookeeper#zookeeper;3.6.0-SNAPSHOT
[ivy:retrieve] 	confs: [default]
[ivy:retrieve] 	found jline#jline;2.11 in maven2
[ivy:retrieve] 	found org.eclipse.jetty#jetty-server;9.4.15.v20190215 in maven2
[ivy:retrieve] 	found javax.servlet#javax.servlet-api;3.1.0 in maven2
[ivy:retrieve] 	found org.eclipse.jetty#jetty-http;9.4.15.v20190215 in maven2
[ivy:retrieve] 	found org.eclipse.jetty#jetty-util;9.4.15.v20190215 in maven2
[ivy:retrieve] 	found org.eclipse.jetty#jetty-io;9.4.15.v20190215 in maven2
[ivy:retrieve] 	found org.eclipse.jetty#jetty-servlet;9.4.15.v20190215 in maven2
[ivy:retrieve] 	found org.eclipse.jetty#jetty-security;9.4.15.v20190215 in maven2
[ivy:retrieve] 	found com.fasterxml.jackson.core#jackson-databind;2.9.9 in maven2
[ivy:retrieve] 	found com.fasterxml.jackson.core#jackson-annotations;2.9.0 in maven2
[ivy:retrieve] 	found com.fasterxml.jackson.core#jackson-core;2.9.9 in maven2
[ivy:retrieve] 	found org.slf4j#slf4j-api;1.7.25 in maven2
[ivy:retrieve] 	found org.slf4j#slf4j-log4j12;1.7.25 in maven2
[ivy:retrieve] 	found commons-cli#commons-cli;1.2 in maven2
[ivy:retrieve] 	found com.github.spotbugs#spotbugs-annotations;3.1.9 in maven2
[ivy:retrieve] 	found com.google.code.findbugs#jsr305;3.0.2 in maven2
[ivy:retrieve] 	found log4j#log4j;1.2.17 in maven2
[ivy:retrieve] 	found org.apache.yetus#audience-annotations;0.5.0 in maven2
[ivy:retrieve] 	found io.netty#netty-all;4.1.36.Final in maven2
[ivy:retrieve] 	found com.googlecode.json-simple#json-simple;1.1.1 in maven2
[ivy:retrieve] 	found commons-lang#commons-lang;2.6 in maven2
[ivy:retrieve] 	found org.xerial.snappy#snappy-java;1.1.7 in maven2
[ivy:retrieve] 	found io.dropwizard.metrics#metrics-core;3.2.5 in maven2
[ivy:retrieve] :: resolution report :: resolve 213ms :: artifacts dl 15ms
	---------------------------------------------------------------------
	|                  |            modules            ||   artifacts   |
	|       conf       | number| search|dwnlded|evicted|| number|dwnlded|
	---------------------------------------------------------------------
	|      default     |   23  |   0   |   0   |   0   ||   23  |   0   |
	---------------------------------------------------------------------
[ivy:retrieve] :: retrieving :: org.apache.zookeeper#zookeeper
[ivy:retrieve] 	confs: [default]
[ivy:retrieve] 	0 artifacts copied, 23 already retrieved (0kB/5ms)

owasp:
[owasp:dependency-check-update] Checking for updates
[owasp:dependency-check-update] starting getUpdatesNeeded() ...
[owasp:dependency-check-update] Download Started for NVD CVE - Modified
[owasp:dependency-check-update] Download Complete for NVD CVE - Modified  (1344 ms)
[owasp:dependency-check-update] Processing Started for NVD CVE - Modified
[owasp:dependency-check-update] Processing Complete for NVD CVE - Modified  (114302 ms)
[owasp:dependency-check-update] Begin database maintenance.
[owasp:dependency-check-update] End database maintenance.
[owasp:dependency-check-update] A new version of dependency-check is available. Consider updating
to version 5.0.0.m2.
[owasp:dependency-check-update] Check for updates complete (201176 ms)
[owasp:dependency-check-update] Checking for updates
[owasp:dependency-check-update] Skipping NVD check since last check was within 4 hours.
[owasp:dependency-check-update] A new version of dependency-check is available. Consider updating
to version 5.0.0.m2.
[owasp:dependency-check-update] Skipping RetireJS update since last update was within 24 hours.
[owasp:dependency-check-update] Check for updates complete (19 ms)
[owasp:dependency-check-update] Analysis Started
[owasp:dependency-check-update] Finished Archive Analyzer (0 seconds)
[owasp:dependency-check-update] Finished File Name Analyzer (0 seconds)
[owasp:dependency-check-update] Finished Jar Analyzer (0 seconds)
[owasp:dependency-check-update] Could not connect to Central search. Analysis failed.
[owasp:dependency-check] An error occurred while analyzing '<https://builds.apache.org/job/ZooKeeper-trunk-owasp/ws/zookeeper-server/src/main/resources/lib/ivy-2.5.0-rc1.jar'>
(Central Analyzer).
[owasp:dependency-check-update] Could not connect to Central search. Analysis failed.
[owasp:dependency-check-update] Could not connect to Central search. Analysis failed.
[owasp:dependency-check] An error occurred while analyzing '<https://builds.apache.org/job/ZooKeeper-trunk-owasp/ws/build/lib/spotbugs-annotations-3.1.9.jar'>
(Central Analyzer).
[owasp:dependency-check] An error occurred while analyzing '<https://builds.apache.org/job/ZooKeeper-trunk-owasp/ws/build/lib/snappy-java-1.1.7.jar'>
(Central Analyzer).
[owasp:dependency-check-update] Finished Central Analyzer (96 seconds)
[owasp:dependency-check-update] Finished Assembly Analyzer (0 seconds)
[owasp:dependency-check-update] Finished Dependency Merging Analyzer (0 seconds)
[owasp:dependency-check-update] Finished Version Filter Analyzer (0 seconds)
[owasp:dependency-check-update] Finished Hint Analyzer (0 seconds)
[owasp:dependency-check-update] Created CPE Index (3 seconds)
[owasp:dependency-check-update] Skipping CPE Analysis for npm
[owasp:dependency-check-update] Finished CPE Analyzer (3 seconds)
[owasp:dependency-check-update] Finished False Positive Analyzer (0 seconds)
[owasp:dependency-check-update] Finished NVD CVE Analyzer (0 seconds)
[owasp:dependency-check-update] Finished Vulnerability Suppression Analyzer (0 seconds)
[owasp:dependency-check-update] Finished Dependency Bundling Analyzer (0 seconds)
[owasp:dependency-check-update] Analysis Complete (102 seconds)

BUILD FAILED
<https://builds.apache.org/job/ZooKeeper-trunk-owasp/ws/build.xml>:1724: Multiple Exceptions
Occurred
org.owasp.dependencycheck.exception.ExceptionCollection: One or more exceptions occurred during
dependency-check analysis
	Could not connect to Central search. Analysis failed.
	Could not connect to Central search. Analysis failed.
	Could not connect to Central search. Analysis failed.
	at org.owasp.dependencycheck.Engine.analyzeDependencies(Engine.java:693)
	at org.owasp.dependencycheck.taskdefs.Check.execute(Check.java:1345)
	at org.apache.tools.ant.UnknownElement.execute(UnknownElement.java:292)
	at jdk.internal.reflect.GeneratedMethodAccessor6.invoke(Unknown Source)
	at java.base/jdk.internal.reflect.DelegatingMethodAccessorImpl.invoke(DelegatingMethodAccessorImpl.java:43)
	at java.base/java.lang.reflect.Method.invoke(Method.java:566)
	at org.apache.tools.ant.dispatch.DispatchUtils.execute(DispatchUtils.java:99)
	at org.apache.tools.ant.Task.perform(Task.java:350)
	at org.apache.tools.ant.Target.execute(Target.java:449)
	at org.apache.tools.ant.Target.performTasks(Target.java:470)
	at org.apache.tools.ant.Project.executeSortedTargets(Project.java:1391)
	at org.apache.tools.ant.Project.executeTarget(Project.java:1364)
	at org.apache.tools.ant.helper.DefaultExecutor.executeTargets(DefaultExecutor.java:41)
	at org.apache.tools.ant.Project.executeTargets(Project.java:1254)
	at org.apache.tools.ant.Main.runBuild(Main.java:830)
	at org.apache.tools.ant.Main.startAnt(Main.java:223)
	at org.apache.tools.ant.launch.Launcher.run(Launcher.java:284)
	at org.apache.tools.ant.launch.Launcher.main(Launcher.java:101)
Next Exception:
org.owasp.dependencycheck.analyzer.exception.AnalysisException: Could not connect to Central
search. Analysis failed.
	at org.owasp.dependencycheck.analyzer.CentralAnalyzer.analyzeDependency(CentralAnalyzer.java:288)
	at org.owasp.dependencycheck.analyzer.AbstractAnalyzer.analyze(AbstractAnalyzer.java:136)
	at org.owasp.dependencycheck.AnalysisTask.call(AnalysisTask.java:88)
	at org.owasp.dependencycheck.AnalysisTask.call(AnalysisTask.java:37)
	at java.base/java.util.concurrent.FutureTask.run(FutureTask.java:264)
	at java.base/java.util.concurrent.ThreadPoolExecutor.runWorker(ThreadPoolExecutor.java:1128)
	at java.base/java.util.concurrent.ThreadPoolExecutor$Worker.run(ThreadPoolExecutor.java:628)
	at java.base/java.lang.Thread.run(Thread.java:834)
Caused by: java.io.IOException: Finally failed connecting to Central search. Giving up after
7 tries.
	at org.owasp.dependencycheck.analyzer.CentralAnalyzer.fetchMavenArtifacts(CentralAnalyzer.java:332)
	at org.owasp.dependencycheck.analyzer.CentralAnalyzer.analyzeDependency(CentralAnalyzer.java:225)
	... 7 more
Caused by: java.io.IOException: Could not connect to MavenCentral (502): Bad Gateway
	at org.owasp.dependencycheck.data.central.CentralSearch.searchSha1(CentralSearch.java:194)
	at org.owasp.dependencycheck.analyzer.CentralAnalyzer.fetchMavenArtifacts(CentralAnalyzer.java:310)
	... 8 more
Next Exception:
org.owasp.dependencycheck.analyzer.exception.AnalysisException: Could not connect to Central
search. Analysis failed.
	at org.owasp.dependencycheck.analyzer.CentralAnalyzer.analyzeDependency(CentralAnalyzer.java:288)
	at org.owasp.dependencycheck.analyzer.AbstractAnalyzer.analyze(AbstractAnalyzer.java:136)
	at org.owasp.dependencycheck.AnalysisTask.call(AnalysisTask.java:88)
	at org.owasp.dependencycheck.AnalysisTask.call(AnalysisTask.java:37)
	at java.base/java.util.concurrent.FutureTask.run(FutureTask.java:264)
	at java.base/java.util.concurrent.ThreadPoolExecutor.runWorker(ThreadPoolExecutor.java:1128)
	at java.base/java.util.concurrent.ThreadPoolExecutor$Worker.run(ThreadPoolExecutor.java:628)
	at java.base/java.lang.Thread.run(Thread.java:834)
Caused by: java.io.IOException: Finally failed connecting to Central search. Giving up after
7 tries.
	at org.owasp.dependencycheck.analyzer.CentralAnalyzer.fetchMavenArtifacts(CentralAnalyzer.java:332)
	at org.owasp.dependencycheck.analyzer.CentralAnalyzer.analyzeDependency(CentralAnalyzer.java:225)
	... 7 more
Caused by: java.io.IOException: Could not connect to MavenCentral (502): Bad Gateway
	at org.owasp.dependencycheck.data.central.CentralSearch.searchSha1(CentralSearch.java:194)
	at org.owasp.dependencycheck.analyzer.CentralAnalyzer.fetchMavenArtifacts(CentralAnalyzer.java:310)
	... 8 more
Next Exception:
org.owasp.dependencycheck.analyzer.exception.AnalysisException: Could not connect to Central
search. Analysis failed.
	at org.owasp.dependencycheck.analyzer.CentralAnalyzer.analyzeDependency(CentralAnalyzer.java:288)
	at org.owasp.dependencycheck.analyzer.AbstractAnalyzer.analyze(AbstractAnalyzer.java:136)
	at org.owasp.dependencycheck.AnalysisTask.call(AnalysisTask.java:88)
	at org.owasp.dependencycheck.AnalysisTask.call(AnalysisTask.java:37)
	at java.base/java.util.concurrent.FutureTask.run(FutureTask.java:264)
	at java.base/java.util.concurrent.ThreadPoolExecutor.runWorker(ThreadPoolExecutor.java:1128)
	at java.base/java.util.concurrent.ThreadPoolExecutor$Worker.run(ThreadPoolExecutor.java:628)
	at java.base/java.lang.Thread.run(Thread.java:834)
Caused by: java.io.IOException: Finally failed connecting to Central search. Giving up after
7 tries.
	at org.owasp.dependencycheck.analyzer.CentralAnalyzer.fetchMavenArtifacts(CentralAnalyzer.java:332)
	at org.owasp.dependencycheck.analyzer.CentralAnalyzer.analyzeDependency(CentralAnalyzer.java:225)
	... 7 more
Caused by: java.io.IOException: Could not connect to MavenCentral (502): Bad Gateway
	at org.owasp.dependencycheck.data.central.CentralSearch.searchSha1(CentralSearch.java:194)
	at org.owasp.dependencycheck.analyzer.CentralAnalyzer.fetchMavenArtifacts(CentralAnalyzer.java:310)
	... 8 more

Total time: 5 minutes 42 seconds
Build step 'Invoke Ant' marked build as failure
Archiving artifacts

Mime
View raw message