zookeeper-dev mailing list archives

Site index · List index
Message view « Date » · « Thread »
Top « Date » · « Thread »
From Apache Jenkins Server <jenk...@builds.apache.org>
Subject Build failed in Jenkins: PreCommit-ZOOKEEPER-github-pr-build-maven #838
Date Thu, 20 Jun 2019 20:29:07 GMT
See <https://builds.apache.org/job/PreCommit-ZOOKEEPER-github-pr-build-maven/838/display/redirect>

------------------------------------------
[...truncated 436.21 KB...]
[INFO] Downloaded from central: https://repo.maven.apache.org/maven2/net/minidev/asm/1.0/asm-1.0.pom
(1.6 kB at 145 kB/s)
[INFO] Downloading from central: https://repo.maven.apache.org/maven2/net/minidev/json-smart/2.1.0/json-smart-2.1.0.pom
[INFO] Downloaded from central: https://repo.maven.apache.org/maven2/net/minidev/json-smart/2.1.0/json-smart-2.1.0.pom
(2.2 kB at 135 kB/s)
[INFO] Downloading from central: https://repo.maven.apache.org/maven2/net/minidev/parent/2.1.0/parent-2.1.0.pom
[INFO] Downloaded from central: https://repo.maven.apache.org/maven2/net/minidev/parent/2.1.0/parent-2.1.0.pom
(8.6 kB at 720 kB/s)
[INFO] Downloading from central: https://repo.maven.apache.org/maven2/net/minidev/asm/1.0.2/asm-1.0.2.pom
[INFO] Downloaded from central: https://repo.maven.apache.org/maven2/net/minidev/asm/1.0.2/asm-1.0.2.pom
(1.8 kB at 163 kB/s)
[INFO] Downloading from central: https://repo.maven.apache.org/maven2/net/minidev/json-smart/2.1.1/json-smart-2.1.1.pom
[INFO] Downloaded from central: https://repo.maven.apache.org/maven2/net/minidev/json-smart/2.1.1/json-smart-2.1.1.pom
(2.2 kB at 170 kB/s)
[INFO] Downloading from central: https://repo.maven.apache.org/maven2/net/minidev/json-smart/2.2/json-smart-2.2.pom
[INFO] Downloaded from central: https://repo.maven.apache.org/maven2/net/minidev/json-smart/2.2/json-smart-2.2.pom
(2.3 kB at 193 kB/s)
[INFO] Downloading from central: https://repo.maven.apache.org/maven2/net/minidev/minidev-parent/2.2/minidev-parent-2.2.pom
[INFO] Downloaded from central: https://repo.maven.apache.org/maven2/net/minidev/minidev-parent/2.2/minidev-parent-2.2.pom
(9.1 kB at 700 kB/s)
[INFO] Downloading from central: https://repo.maven.apache.org/maven2/net/minidev/accessors-smart/1.1/accessors-smart-1.1.pom
[INFO] Downloaded from central: https://repo.maven.apache.org/maven2/net/minidev/accessors-smart/1.1/accessors-smart-1.1.pom
(2.1 kB at 91 kB/s)
[INFO] Downloading from central: https://repo.maven.apache.org/maven2/org/ow2/asm/asm/5.0.3/asm-5.0.3.pom
[INFO] Downloaded from central: https://repo.maven.apache.org/maven2/org/ow2/asm/asm/5.0.3/asm-5.0.3.pom
(1.9 kB at 176 kB/s)
[INFO] Downloading from central: https://repo.maven.apache.org/maven2/org/ow2/asm/asm-parent/5.0.3/asm-parent-5.0.3.pom
[INFO] Downloaded from central: https://repo.maven.apache.org/maven2/org/ow2/asm/asm-parent/5.0.3/asm-parent-5.0.3.pom
(5.5 kB at 500 kB/s)
[INFO] Downloading from central: https://repo.maven.apache.org/maven2/net/minidev/json-smart/2.2.1/json-smart-2.2.1.pom
[INFO] Downloaded from central: https://repo.maven.apache.org/maven2/net/minidev/json-smart/2.2.1/json-smart-2.2.1.pom
(12 kB at 1.0 MB/s)
[INFO] Downloading from central: https://repo.maven.apache.org/maven2/net/minidev/json-smart/2.3/json-smart-2.3.pom
[INFO] Downloaded from central: https://repo.maven.apache.org/maven2/net/minidev/json-smart/2.3/json-smart-2.3.pom
(9.0 kB at 902 kB/s)
[INFO] Downloading from central: https://repo.maven.apache.org/maven2/net/minidev/minidev-parent/2.3/minidev-parent-2.3.pom
[INFO] Downloaded from central: https://repo.maven.apache.org/maven2/net/minidev/minidev-parent/2.3/minidev-parent-2.3.pom
(8.5 kB at 771 kB/s)
[INFO] Downloading from central: https://repo.maven.apache.org/maven2/net/minidev/accessors-smart/1.2/accessors-smart-1.2.pom
[INFO] Downloaded from central: https://repo.maven.apache.org/maven2/net/minidev/accessors-smart/1.2/accessors-smart-1.2.pom
(12 kB at 964 kB/s)
[INFO] Downloading from central: https://repo.maven.apache.org/maven2/org/ow2/asm/asm/5.0.4/asm-5.0.4.pom
[INFO] Downloaded from central: https://repo.maven.apache.org/maven2/org/ow2/asm/asm/5.0.4/asm-5.0.4.pom
(1.9 kB at 194 kB/s)
[INFO] Downloading from central: https://repo.maven.apache.org/maven2/org/ow2/asm/asm-parent/5.0.4/asm-parent-5.0.4.pom
[INFO] Downloaded from central: https://repo.maven.apache.org/maven2/org/ow2/asm/asm-parent/5.0.4/asm-parent-5.0.4.pom
(5.5 kB at 500 kB/s)
[INFO] Downloading from central: https://repo.maven.apache.org/maven2/org/apache/kerby/kerb-admin/1.1.0/kerb-admin-1.1.0.pom
[INFO] Downloaded from central: https://repo.maven.apache.org/maven2/org/apache/kerby/kerb-admin/1.1.0/kerb-admin-1.1.0.pom
(1.7 kB at 138 kB/s)
[INFO] Downloading from central: https://repo.maven.apache.org/maven2/org/apache/kerby/kerb-server/1.1.0/kerb-server-1.1.0.pom
[INFO] Downloaded from central: https://repo.maven.apache.org/maven2/org/apache/kerby/kerb-server/1.1.0/kerb-server-1.1.0.pom
(1.9 kB at 172 kB/s)
[INFO] Downloading from central: https://repo.maven.apache.org/maven2/org/apache/kerby/kerb-identity/1.1.0/kerb-identity-1.1.0.pom
[INFO] Downloaded from central: https://repo.maven.apache.org/maven2/org/apache/kerby/kerb-identity/1.1.0/kerb-identity-1.1.0.pom
(1.7 kB at 104 kB/s)
[INFO] Downloading from central: https://repo.maven.apache.org/maven2/org/apache/kerby/kerby-xdr/1.1.0/kerby-xdr-1.1.0.pom
[INFO] Downloaded from central: https://repo.maven.apache.org/maven2/org/apache/kerby/kerby-xdr/1.1.0/kerby-xdr-1.1.0.pom
(1.4 kB at 92 kB/s)
[INFO] Downloading from central: https://repo.maven.apache.org/maven2/org/mockito/mockito-core/2.27.0/mockito-core-2.27.0.pom
[INFO] Downloaded from central: https://repo.maven.apache.org/maven2/org/mockito/mockito-core/2.27.0/mockito-core-2.27.0.pom
(19 kB at 1.5 MB/s)
[INFO] Downloading from central: https://repo.maven.apache.org/maven2/net/bytebuddy/byte-buddy/1.9.10/byte-buddy-1.9.10.pom
[INFO] Downloaded from central: https://repo.maven.apache.org/maven2/net/bytebuddy/byte-buddy/1.9.10/byte-buddy-1.9.10.pom
(10 kB at 939 kB/s)
[INFO] Downloading from central: https://repo.maven.apache.org/maven2/net/bytebuddy/byte-buddy-parent/1.9.10/byte-buddy-parent-1.9.10.pom
[INFO] Downloaded from central: https://repo.maven.apache.org/maven2/net/bytebuddy/byte-buddy-parent/1.9.10/byte-buddy-parent-1.9.10.pom
(36 kB at 2.6 MB/s)
[INFO] Downloading from central: https://repo.maven.apache.org/maven2/net/bytebuddy/byte-buddy-agent/1.9.10/byte-buddy-agent-1.9.10.pom
[INFO] Downloaded from central: https://repo.maven.apache.org/maven2/net/bytebuddy/byte-buddy-agent/1.9.10/byte-buddy-agent-1.9.10.pom
(6.0 kB at 548 kB/s)
[INFO] Downloading from central: https://repo.maven.apache.org/maven2/org/xerial/snappy/snappy-java/1.1.7/snappy-java-1.1.7.pom
[INFO] Downloaded from central: https://repo.maven.apache.org/maven2/org/xerial/snappy/snappy-java/1.1.7/snappy-java-1.1.7.pom
(4.0 kB at 332 kB/s)
[INFO] Downloading from central: https://repo.maven.apache.org/maven2/org/hamcrest/hamcrest-all/1.3/hamcrest-all-1.3.jar
[INFO] Downloading from central: https://repo.maven.apache.org/maven2/io/netty/netty-all/4.1.36.Final/netty-all-4.1.36.Final.jar
[INFO] Downloading from central: https://repo.maven.apache.org/maven2/org/slf4j/slf4j-api/1.7.25/slf4j-api-1.7.25.jar
[INFO] Downloading from central: https://repo.maven.apache.org/maven2/org/slf4j/slf4j-log4j12/1.7.25/slf4j-log4j12-1.7.25.jar
[INFO] Downloading from central: https://repo.maven.apache.org/maven2/org/eclipse/jetty/jetty-server/9.4.17.v20190418/jetty-server-9.4.17.v20190418.jar
[INFO] Downloaded from central: https://repo.maven.apache.org/maven2/org/slf4j/slf4j-api/1.7.25/slf4j-api-1.7.25.jar
(41 kB at 2.6 MB/s)
[INFO] Downloading from central: https://repo.maven.apache.org/maven2/javax/servlet/javax.servlet-api/3.1.0/javax.servlet-api-3.1.0.jar
[INFO] Downloaded from central: https://repo.maven.apache.org/maven2/org/slf4j/slf4j-log4j12/1.7.25/slf4j-log4j12-1.7.25.jar
(12 kB at 510 kB/s)
[INFO] Downloading from central: https://repo.maven.apache.org/maven2/org/eclipse/jetty/jetty-http/9.4.17.v20190418/jetty-http-9.4.17.v20190418.jar
[INFO] Downloaded from central: https://repo.maven.apache.org/maven2/org/hamcrest/hamcrest-all/1.3/hamcrest-all-1.3.jar
(307 kB at 11 MB/s)
[INFO] Downloading from central: https://repo.maven.apache.org/maven2/org/eclipse/jetty/jetty-util/9.4.17.v20190418/jetty-util-9.4.17.v20190418.jar
[INFO] Downloaded from central: https://repo.maven.apache.org/maven2/javax/servlet/javax.servlet-api/3.1.0/javax.servlet-api-3.1.0.jar
(96 kB at 3.1 MB/s)
[INFO] Downloading from central: https://repo.maven.apache.org/maven2/org/eclipse/jetty/jetty-io/9.4.17.v20190418/jetty-io-9.4.17.v20190418.jar
[INFO] Downloaded from central: https://repo.maven.apache.org/maven2/org/eclipse/jetty/jetty-server/9.4.17.v20190418/jetty-server-9.4.17.v20190418.jar
(647 kB at 15 MB/s)
[INFO] Downloading from central: https://repo.maven.apache.org/maven2/org/eclipse/jetty/jetty-servlet/9.4.17.v20190418/jetty-servlet-9.4.17.v20190418.jar
[INFO] Downloaded from central: https://repo.maven.apache.org/maven2/org/eclipse/jetty/jetty-http/9.4.17.v20190418/jetty-http-9.4.17.v20190418.jar
(203 kB at 4.5 MB/s)
[INFO] Downloading from central: https://repo.maven.apache.org/maven2/org/eclipse/jetty/jetty-security/9.4.17.v20190418/jetty-security-9.4.17.v20190418.jar
[INFO] Downloaded from central: https://repo.maven.apache.org/maven2/org/eclipse/jetty/jetty-io/9.4.17.v20190418/jetty-io-9.4.17.v20190418.jar
(156 kB at 3.1 MB/s)
[INFO] Downloading from central: https://repo.maven.apache.org/maven2/com/fasterxml/jackson/core/jackson-databind/2.9.9/jackson-databind-2.9.9.jar
[INFO] Downloaded from central: https://repo.maven.apache.org/maven2/org/eclipse/jetty/jetty-servlet/9.4.17.v20190418/jetty-servlet-9.4.17.v20190418.jar
(121 kB at 1.9 MB/s)
[INFO] Downloading from central: https://repo.maven.apache.org/maven2/com/fasterxml/jackson/core/jackson-core/2.9.9/jackson-core-2.9.9.jar
[INFO] Downloaded from central: https://repo.maven.apache.org/maven2/org/eclipse/jetty/jetty-security/9.4.17.v20190418/jetty-security-9.4.17.v20190418.jar
(116 kB at 1.8 MB/s)
[INFO] Downloading from central: https://repo.maven.apache.org/maven2/com/googlecode/json-simple/json-simple/1.1.1/json-simple-1.1.1.jar
[INFO] Downloaded from central: https://repo.maven.apache.org/maven2/org/eclipse/jetty/jetty-util/9.4.17.v20190418/jetty-util-9.4.17.v20190418.jar
(526 kB at 7.4 MB/s)
[INFO] Downloading from central: https://repo.maven.apache.org/maven2/org/bouncycastle/bcpkix-jdk15on/1.60/bcpkix-jdk15on-1.60.jar
[INFO] Downloaded from central: https://repo.maven.apache.org/maven2/com/googlecode/json-simple/json-simple/1.1.1/json-simple-1.1.1.jar
(24 kB at 299 kB/s)
[INFO] Downloading from central: https://repo.maven.apache.org/maven2/jline/jline/2.11/jline-2.11.jar
[INFO] Downloaded from central: https://repo.maven.apache.org/maven2/com/fasterxml/jackson/core/jackson-core/2.9.9/jackson-core-2.9.9.jar
(326 kB at 3.5 MB/s)
[INFO] Downloading from central: https://repo.maven.apache.org/maven2/io/dropwizard/metrics/metrics-core/3.2.5/metrics-core-3.2.5.jar
[INFO] Downloaded from central: https://repo.maven.apache.org/maven2/jline/jline/2.11/jline-2.11.jar
(209 kB at 1.9 MB/s)
[INFO] Downloading from central: https://repo.maven.apache.org/maven2/log4j/log4j/1.2.17/log4j-1.2.17.jar
[INFO] Downloaded from central: https://repo.maven.apache.org/maven2/io/dropwizard/metrics/metrics-core/3.2.5/metrics-core-3.2.5.jar
(136 kB at 1.2 MB/s)
[INFO] Downloading from central: https://repo.maven.apache.org/maven2/org/apache/kerby/kerb-core/1.1.0/kerb-core-1.1.0.jar
[INFO] Downloaded from central: https://repo.maven.apache.org/maven2/org/bouncycastle/bcpkix-jdk15on/1.60/bcpkix-jdk15on-1.60.jar
(797 kB at 6.9 MB/s)
[INFO] Downloading from central: https://repo.maven.apache.org/maven2/org/apache/kerby/kerby-pkix/1.1.0/kerby-pkix-1.1.0.jar
[INFO] Downloaded from central: https://repo.maven.apache.org/maven2/com/fasterxml/jackson/core/jackson-databind/2.9.9/jackson-databind-2.9.9.jar
(1.3 MB at 10 MB/s)
[INFO] Downloading from central: https://repo.maven.apache.org/maven2/org/apache/kerby/kerby-asn1/1.1.0/kerby-asn1-1.1.0.jar
[INFO] Downloaded from central: https://repo.maven.apache.org/maven2/org/apache/kerby/kerb-core/1.1.0/kerb-core-1.1.0.jar
(228 kB at 1.6 MB/s)
[INFO] Downloading from central: https://repo.maven.apache.org/maven2/org/apache/kerby/kerby-util/1.1.0/kerby-util-1.1.0.jar
[INFO] Downloaded from central: https://repo.maven.apache.org/maven2/org/apache/kerby/kerby-pkix/1.1.0/kerby-pkix-1.1.0.jar
(205 kB at 1.5 MB/s)
[INFO] Downloading from central: https://repo.maven.apache.org/maven2/org/apache/kerby/kerb-simplekdc/1.1.0/kerb-simplekdc-1.1.0.jar
[INFO] Downloaded from central: https://repo.maven.apache.org/maven2/log4j/log4j/1.2.17/log4j-1.2.17.jar
(490 kB at 3.4 MB/s)
[INFO] Downloading from central: https://repo.maven.apache.org/maven2/org/apache/kerby/kerb-client/1.1.0/kerb-client-1.1.0.jar
[INFO] Downloaded from central: https://repo.maven.apache.org/maven2/org/apache/kerby/kerby-asn1/1.1.0/kerby-asn1-1.1.0.jar
(102 kB at 686 kB/s)
[INFO] Downloading from central: https://repo.maven.apache.org/maven2/org/apache/kerby/kerb-common/1.1.0/kerb-common-1.1.0.jar
[INFO] Downloaded from central: https://repo.maven.apache.org/maven2/org/apache/kerby/kerb-simplekdc/1.1.0/kerb-simplekdc-1.1.0.jar
(20 kB at 135 kB/s)
[INFO] Downloading from central: https://repo.maven.apache.org/maven2/org/apache/kerby/kerb-crypto/1.1.0/kerb-crypto-1.1.0.jar
[INFO] Downloaded from central: https://repo.maven.apache.org/maven2/org/apache/kerby/kerby-util/1.1.0/kerby-util-1.1.0.jar
(41 kB at 264 kB/s)
[INFO] Downloading from central: https://repo.maven.apache.org/maven2/org/apache/kerby/kerb-util/1.1.0/kerb-util-1.1.0.jar
[INFO] Downloaded from central: https://repo.maven.apache.org/maven2/org/apache/kerby/kerb-client/1.1.0/kerb-client-1.1.0.jar
(117 kB at 711 kB/s)
[INFO] Downloading from central: https://repo.maven.apache.org/maven2/org/apache/kerby/token-provider/1.1.0/token-provider-1.1.0.jar
[INFO] Downloaded from central: https://repo.maven.apache.org/maven2/org/apache/kerby/kerb-util/1.1.0/kerb-util-1.1.0.jar
(37 kB at 219 kB/s)
[INFO] Downloading from central: https://repo.maven.apache.org/maven2/com/nimbusds/nimbus-jose-jwt/4.41.2/nimbus-jose-jwt-4.41.2.jar
[INFO] Downloaded from central: https://repo.maven.apache.org/maven2/org/apache/kerby/kerb-common/1.1.0/kerb-common-1.1.0.jar
(71 kB at 422 kB/s)
[INFO] Downloading from central: https://repo.maven.apache.org/maven2/com/github/stephenc/jcip/jcip-annotations/1.0-1/jcip-annotations-1.0-1.jar
[INFO] Downloaded from central: https://repo.maven.apache.org/maven2/org/apache/kerby/kerb-crypto/1.1.0/kerb-crypto-1.1.0.jar
(117 kB at 679 kB/s)
[INFO] Downloading from central: https://repo.maven.apache.org/maven2/net/minidev/json-smart/2.3/json-smart-2.3.jar
[INFO] Downloaded from central: https://repo.maven.apache.org/maven2/org/apache/kerby/token-provider/1.1.0/token-provider-1.1.0.jar
(20 kB at 110 kB/s)
[INFO] Downloading from central: https://repo.maven.apache.org/maven2/net/minidev/accessors-smart/1.2/accessors-smart-1.2.jar
[INFO] Downloaded from central: https://repo.maven.apache.org/maven2/com/github/stephenc/jcip/jcip-annotations/1.0-1/jcip-annotations-1.0-1.jar
(4.7 kB at 26 kB/s)
[INFO] Downloading from central: https://repo.maven.apache.org/maven2/org/ow2/asm/asm/5.0.4/asm-5.0.4.jar
[INFO] Downloaded from central: https://repo.maven.apache.org/maven2/net/minidev/json-smart/2.3/json-smart-2.3.jar
(120 kB at 640 kB/s)
[INFO] Downloading from central: https://repo.maven.apache.org/maven2/org/apache/kerby/kerb-admin/1.1.0/kerb-admin-1.1.0.jar
[INFO] Downloaded from central: https://repo.maven.apache.org/maven2/net/minidev/accessors-smart/1.2/accessors-smart-1.2.jar
(30 kB at 158 kB/s)
[INFO] Downloading from central: https://repo.maven.apache.org/maven2/org/apache/kerby/kerb-server/1.1.0/kerb-server-1.1.0.jar
[INFO] Downloaded from central: https://repo.maven.apache.org/maven2/org/ow2/asm/asm/5.0.4/asm-5.0.4.jar
(53 kB at 278 kB/s)
[INFO] Downloading from central: https://repo.maven.apache.org/maven2/org/apache/kerby/kerb-identity/1.1.0/kerb-identity-1.1.0.jar
[INFO] Downloaded from central: https://repo.maven.apache.org/maven2/com/nimbusds/nimbus-jose-jwt/4.41.2/nimbus-jose-jwt-4.41.2.jar
(300 kB at 1.5 MB/s)
[INFO] Downloading from central: https://repo.maven.apache.org/maven2/org/apache/kerby/kerby-xdr/1.1.0/kerby-xdr-1.1.0.jar
[INFO] Downloaded from central: https://repo.maven.apache.org/maven2/org/apache/kerby/kerb-identity/1.1.0/kerb-identity-1.1.0.jar
(18 kB at 88 kB/s)
[INFO] Downloading from central: https://repo.maven.apache.org/maven2/org/apache/kerby/kerby-config/1.1.0/kerby-config-1.1.0.jar
[INFO] Downloaded from central: https://repo.maven.apache.org/maven2/org/apache/kerby/kerb-admin/1.1.0/kerb-admin-1.1.0.jar
(81 kB at 384 kB/s)
[INFO] Downloading from central: https://repo.maven.apache.org/maven2/org/mockito/mockito-core/2.27.0/mockito-core-2.27.0.jar
[INFO] Downloaded from central: https://repo.maven.apache.org/maven2/org/apache/kerby/kerb-server/1.1.0/kerb-server-1.1.0.jar
(85 kB at 401 kB/s)
[INFO] Downloading from central: https://repo.maven.apache.org/maven2/net/bytebuddy/byte-buddy/1.9.10/byte-buddy-1.9.10.jar
[INFO] Downloaded from central: https://repo.maven.apache.org/maven2/org/apache/kerby/kerby-xdr/1.1.0/kerby-xdr-1.1.0.jar
(29 kB at 137 kB/s)
[INFO] Downloading from central: https://repo.maven.apache.org/maven2/net/bytebuddy/byte-buddy-agent/1.9.10/byte-buddy-agent-1.9.10.jar
[INFO] Downloaded from central: https://repo.maven.apache.org/maven2/org/apache/kerby/kerby-config/1.1.0/kerby-config-1.1.0.jar
(31 kB at 138 kB/s)
[INFO] Downloading from central: https://repo.maven.apache.org/maven2/org/xerial/snappy/snappy-java/1.1.7/snappy-java-1.1.7.jar
[INFO] Downloaded from central: https://repo.maven.apache.org/maven2/io/netty/netty-all/4.1.36.Final/netty-all-4.1.36.Final.jar
(4.0 MB at 17 MB/s)
[INFO] Downloaded from central: https://repo.maven.apache.org/maven2/net/bytebuddy/byte-buddy-agent/1.9.10/byte-buddy-agent-1.9.10.jar
(43 kB at 179 kB/s)
[INFO] Downloaded from central: https://repo.maven.apache.org/maven2/org/mockito/mockito-core/2.27.0/mockito-core-2.27.0.jar
(588 kB at 2.3 MB/s)
[INFO] Downloaded from central: https://repo.maven.apache.org/maven2/net/bytebuddy/byte-buddy/1.9.10/byte-buddy-1.9.10.jar
(3.3 MB at 9.0 MB/s)
[INFO] Downloaded from central: https://repo.maven.apache.org/maven2/org/xerial/snappy/snappy-java/1.1.7/snappy-java-1.1.7.jar
(2.0 MB at 4.8 MB/s)
[INFO] 
[INFO] --- git-commit-id-plugin:3.0.0:revision (find-current-git-revision) @ zookeeper ---
[INFO] 
[INFO] --- maven-antrun-plugin:1.8:run (default) @ zookeeper ---
[INFO] Executing tasks

main:
[INFO] Executed tasks
[INFO] 
[INFO] --- build-helper-maven-plugin:3.0.0:timestamp-property (tbuild-time) @ zookeeper ---
[INFO] 
[INFO] --- properties-maven-plugin:1.0.0:read-project-properties (default) @ zookeeper ---
[INFO] Downloading from central: https://repo.maven.apache.org/maven2/org/codehaus/plexus/plexus-utils/3.0.22/plexus-utils-3.0.22.jar
[INFO] Downloaded from central: https://repo.maven.apache.org/maven2/org/codehaus/plexus/plexus-utils/3.0.22/plexus-utils-3.0.22.jar
(245 kB at 9.8 MB/s)
[INFO] 
[INFO] --- maven-compiler-plugin:3.8.0:compile (pre-compile-vergen) @ zookeeper ---
[INFO] Changes detected - recompiling the module!
[INFO] Compiling 1 source file to <https://builds.apache.org/job/PreCommit-ZOOKEEPER-github-pr-build-maven/ws/zookeeper-server/target/classes>
[INFO] 
[INFO] --- exec-maven-plugin:1.6.0:exec (generate-version-info) @ zookeeper ---
[INFO] 
[INFO] --- maven-remote-resources-plugin:1.5:process (process-resource-bundles) @ zookeeper
---
[INFO] artifact net.minidev:json-smart: checking for updates from central
[INFO] 
[INFO] --- maven-resources-plugin:2.7:resources (default-resources) @ zookeeper ---
[INFO] Using 'UTF-8' encoding to copy filtered resources.
[INFO] skip non existing resourceDirectory <https://builds.apache.org/job/PreCommit-ZOOKEEPER-github-pr-build-maven/ws/zookeeper-serversrc/main/java/resources>
[INFO] Copying 3 resources
[INFO] 
[INFO] --- maven-compiler-plugin:3.8.0:compile (default-compile) @ zookeeper ---
[INFO] Changes detected - recompiling the module!
[INFO] Compiling 327 source files to <https://builds.apache.org/job/PreCommit-ZOOKEEPER-github-pr-build-maven/ws/zookeeper-server/target/classes>
[INFO] -------------------------------------------------------------
[ERROR] COMPILATION ERROR : 
[INFO] -------------------------------------------------------------
[ERROR] <https://builds.apache.org/job/PreCommit-ZOOKEEPER-github-pr-build-maven/ws/zookeeper-server/src/main/java/org/apache/zookeeper/server/instrument/TraceLogger.java>:[105,12]
bad use of '>'
[ERROR] <https://builds.apache.org/job/PreCommit-ZOOKEEPER-github-pr-build-maven/ws/zookeeper-server/src/main/java/org/apache/zookeeper/server/instrument/TraceLogger.java>:[105,29]
bad use of '>'
[ERROR] <https://builds.apache.org/job/PreCommit-ZOOKEEPER-github-pr-build-maven/ws/zookeeper-server/src/main/java/org/apache/zookeeper/server/instrument/TraceLogger.java>:[105,41]
bad use of '>'
[ERROR] <https://builds.apache.org/job/PreCommit-ZOOKEEPER-github-pr-build-maven/ws/zookeeper-server/src/main/java/org/apache/zookeeper/server/instrument/TraceField.java>:[27,9]
bad use of '>'
[ERROR] <https://builds.apache.org/job/PreCommit-ZOOKEEPER-github-pr-build-maven/ws/zookeeper-server/src/main/java/org/apache/zookeeper/server/instrument/TraceField.java>:[28,9]
bad use of '>'
[ERROR] <https://builds.apache.org/job/PreCommit-ZOOKEEPER-github-pr-build-maven/ws/zookeeper-server/src/main/java/org/apache/zookeeper/server/instrument/TraceField.java>:[29,9]
bad use of '>'
[INFO] 6 errors 
[INFO] -------------------------------------------------------------
[INFO] ------------------------------------------------------------------------
[INFO] Reactor Summary for Apache ZooKeeper 3.6.0-SNAPSHOT:
[INFO] 
[INFO] Apache ZooKeeper ................................... SUCCESS [ 23.368 s]
[INFO] Apache ZooKeeper - Documentation ................... SUCCESS [  9.466 s]
[INFO] Apache ZooKeeper - Jute ............................ SUCCESS [01:14 min]
[INFO] Apache ZooKeeper - Server .......................... FAILURE [  9.596 s]
[INFO] Apache ZooKeeper - Metrics Providers ............... SKIPPED
[INFO] Apache ZooKeeper - Prometheus.io Metrics Provider .. SKIPPED
[INFO] Apache ZooKeeper - Client .......................... SKIPPED
[INFO] Apache ZooKeeper - Client - C ...................... SKIPPED
[INFO] Apache ZooKeeper - Recipes ......................... SKIPPED
[INFO] Apache ZooKeeper - Recipes - Election .............. SKIPPED
[INFO] Apache ZooKeeper - Recipes - Lock .................. SKIPPED
[INFO] Apache ZooKeeper - Recipes - Queue ................. SKIPPED
[INFO] Apache ZooKeeper - Assembly ........................ SKIPPED
[INFO] Apache ZooKeeper - Contrib ......................... SKIPPED
[INFO] Apache ZooKeeper - Contrib - Loggraph .............. SKIPPED
[INFO] Apache ZooKeeper - Contrib - Rest .................. SKIPPED
[INFO] Apache ZooKeeper - Contrib - ZooInspector .......... SKIPPED
[INFO] ------------------------------------------------------------------------
[INFO] BUILD FAILURE
[INFO] ------------------------------------------------------------------------
[INFO] Total time:  02:31 min
[INFO] Finished at: 2019-06-20T20:28:29Z
[INFO] ------------------------------------------------------------------------
Waiting for Jenkins to finish collecting data
[ERROR] Failed to execute goal org.apache.maven.plugins:maven-compiler-plugin:3.8.0:compile
(default-compile) on project zookeeper: Compilation failure: Compilation failure:
[ERROR] <https://builds.apache.org/job/PreCommit-ZOOKEEPER-github-pr-build-maven/ws/zookeeper-server/src/main/java/org/apache/zookeeper/server/instrument/TraceLogger.java>:[105,12]
bad use of '>'
[ERROR] <https://builds.apache.org/job/PreCommit-ZOOKEEPER-github-pr-build-maven/ws/zookeeper-server/src/main/java/org/apache/zookeeper/server/instrument/TraceLogger.java>:[105,29]
bad use of '>'
[ERROR] <https://builds.apache.org/job/PreCommit-ZOOKEEPER-github-pr-build-maven/ws/zookeeper-server/src/main/java/org/apache/zookeeper/server/instrument/TraceLogger.java>:[105,41]
bad use of '>'
[ERROR] <https://builds.apache.org/job/PreCommit-ZOOKEEPER-github-pr-build-maven/ws/zookeeper-server/src/main/java/org/apache/zookeeper/server/instrument/TraceField.java>:[27,9]
bad use of '>'
[ERROR] <https://builds.apache.org/job/PreCommit-ZOOKEEPER-github-pr-build-maven/ws/zookeeper-server/src/main/java/org/apache/zookeeper/server/instrument/TraceField.java>:[28,9]
bad use of '>'
[ERROR] <https://builds.apache.org/job/PreCommit-ZOOKEEPER-github-pr-build-maven/ws/zookeeper-server/src/main/java/org/apache/zookeeper/server/instrument/TraceField.java>:[29,9]
bad use of '>'
[ERROR] -> [Help 1]
[ERROR] 
[ERROR] To see the full stack trace of the errors, re-run Maven with the -e switch.
[ERROR] Re-run Maven using the -X switch to enable full debug logging.
[ERROR] 
[ERROR] For more information about the errors and possible solutions, please read the following
articles:
[ERROR] [Help 1] http://cwiki.apache.org/confluence/display/MAVEN/MojoFailureException
[ERROR] 
[ERROR] After correcting the problems, you can resume the build with the command
[ERROR]   mvn <goals> -rf :zookeeper
[JENKINS] Archiving <https://builds.apache.org/job/PreCommit-ZOOKEEPER-github-pr-build-maven/ws/zookeeper-server/pom.xml>
to org.apache.zookeeper/zookeeper/3.6.0-SNAPSHOT/zookeeper-3.6.0-SNAPSHOT.pom
[JENKINS] Archiving <https://builds.apache.org/job/PreCommit-ZOOKEEPER-github-pr-build-maven/ws/zookeeper-contrib/zookeeper-contrib-loggraph/pom.xml>
to org.apache.zookeeper/zookeeper-contrib-loggraph/3.6.0-SNAPSHOT/zookeeper-contrib-loggraph-3.6.0-SNAPSHOT.pom
[JENKINS] Archiving <https://builds.apache.org/job/PreCommit-ZOOKEEPER-github-pr-build-maven/ws/zookeeper-metrics-providers/pom.xml>
to org.apache.zookeeper/zookeeper-metrics-providers/3.6.0-SNAPSHOT/zookeeper-metrics-providers-3.6.0-SNAPSHOT.pom
[JENKINS] Archiving <https://builds.apache.org/job/PreCommit-ZOOKEEPER-github-pr-build-maven/ws/zookeeper-metrics-providers/zookeeper-prometheus-metrics/pom.xml>
to org.apache.zookeeper/zookeeper-prometheus-metrics/3.6.0-SNAPSHOT/zookeeper-prometheus-metrics-3.6.0-SNAPSHOT.pom
[JENKINS] Archiving <https://builds.apache.org/job/PreCommit-ZOOKEEPER-github-pr-build-maven/ws/zookeeper-recipes/zookeeper-recipes-election/pom.xml>
to org.apache.zookeeper/zookeeper-recipes-election/3.6.0-SNAPSHOT/zookeeper-recipes-election-3.6.0-SNAPSHOT.pom
[JENKINS] Archiving <https://builds.apache.org/job/PreCommit-ZOOKEEPER-github-pr-build-maven/ws/pom.xml>
to org.apache.zookeeper/parent/3.6.0-SNAPSHOT/parent-3.6.0-SNAPSHOT.pom
[JENKINS] Archiving <https://builds.apache.org/job/PreCommit-ZOOKEEPER-github-pr-build-maven/ws/zookeeper-recipes/zookeeper-recipes-lock/pom.xml>
to org.apache.zookeeper/zookeeper-recipes-lock/3.6.0-SNAPSHOT/zookeeper-recipes-lock-3.6.0-SNAPSHOT.pom
[JENKINS] Archiving <https://builds.apache.org/job/PreCommit-ZOOKEEPER-github-pr-build-maven/ws/zookeeper-contrib/pom.xml>
to org.apache.zookeeper/zookeeper-contrib/3.6.0-SNAPSHOT/zookeeper-contrib-3.6.0-SNAPSHOT.pom
[JENKINS] Archiving <https://builds.apache.org/job/PreCommit-ZOOKEEPER-github-pr-build-maven/ws/zookeeper-client/pom.xml>
to org.apache.zookeeper/zookeeper-client/3.6.0-SNAPSHOT/zookeeper-client-3.6.0-SNAPSHOT.pom
[JENKINS] Archiving <https://builds.apache.org/job/PreCommit-ZOOKEEPER-github-pr-build-maven/ws/zookeeper-jute/pom.xml>
to org.apache.zookeeper/zookeeper-jute/3.6.0-SNAPSHOT/zookeeper-jute-3.6.0-SNAPSHOT.pom
[JENKINS] Archiving <https://builds.apache.org/job/PreCommit-ZOOKEEPER-github-pr-build-maven/ws/zookeeper-jute/target/zookeeper-jute-3.6.0-SNAPSHOT.jar>
to org.apache.zookeeper/zookeeper-jute/3.6.0-SNAPSHOT/zookeeper-jute-3.6.0-SNAPSHOT.jar
[JENKINS] Archiving <https://builds.apache.org/job/PreCommit-ZOOKEEPER-github-pr-build-maven/ws/zookeeper-jute/target/zookeeper-jute-3.6.0-SNAPSHOT-tests.jar>
to org.apache.zookeeper/zookeeper-jute/3.6.0-SNAPSHOT/zookeeper-jute-3.6.0-SNAPSHOT-tests.jar
[JENKINS] Archiving <https://builds.apache.org/job/PreCommit-ZOOKEEPER-github-pr-build-maven/ws/zookeeper-jute/target/zookeeper-jute-3.6.0-SNAPSHOT-sources.jar>
to org.apache.zookeeper/zookeeper-jute/3.6.0-SNAPSHOT/zookeeper-jute-3.6.0-SNAPSHOT-sources.jar
[JENKINS] Archiving <https://builds.apache.org/job/PreCommit-ZOOKEEPER-github-pr-build-maven/ws/zookeeper-jute/target/zookeeper-jute-3.6.0-SNAPSHOT-javadoc.jar>
to org.apache.zookeeper/zookeeper-jute/3.6.0-SNAPSHOT/zookeeper-jute-3.6.0-SNAPSHOT-javadoc.jar
[JENKINS] Archiving <https://builds.apache.org/job/PreCommit-ZOOKEEPER-github-pr-build-maven/ws/zookeeper-recipes/zookeeper-recipes-queue/pom.xml>
to org.apache.zookeeper/zookeeper-recipes-queue/3.6.0-SNAPSHOT/zookeeper-recipes-queue-3.6.0-SNAPSHOT.pom
[JENKINS] Archiving <https://builds.apache.org/job/PreCommit-ZOOKEEPER-github-pr-build-maven/ws/zookeeper-docs/pom.xml>
to org.apache.zookeeper/zookeeper-docs/3.6.0-SNAPSHOT/zookeeper-docs-3.6.0-SNAPSHOT.pom
[JENKINS] Archiving <https://builds.apache.org/job/PreCommit-ZOOKEEPER-github-pr-build-maven/ws/zookeeper-docs/target/zookeeper-docs-3.6.0-SNAPSHOT.jar>
to org.apache.zookeeper/zookeeper-docs/3.6.0-SNAPSHOT/zookeeper-docs-3.6.0-SNAPSHOT.jar
[JENKINS] Archiving <https://builds.apache.org/job/PreCommit-ZOOKEEPER-github-pr-build-maven/ws/zookeeper-docs/target/zookeeper-docs-3.6.0-SNAPSHOT-tests.jar>
to org.apache.zookeeper/zookeeper-docs/3.6.0-SNAPSHOT/zookeeper-docs-3.6.0-SNAPSHOT-tests.jar
[JENKINS] Archiving <https://builds.apache.org/job/PreCommit-ZOOKEEPER-github-pr-build-maven/ws/zookeeper-docs/target/zookeeper-docs-3.6.0-SNAPSHOT-sources.jar>
to org.apache.zookeeper/zookeeper-docs/3.6.0-SNAPSHOT/zookeeper-docs-3.6.0-SNAPSHOT-sources.jar
[JENKINS] Archiving <https://builds.apache.org/job/PreCommit-ZOOKEEPER-github-pr-build-maven/ws/zookeeper-recipes/pom.xml>
to org.apache.zookeeper/zookeeper-recipes/3.6.0-SNAPSHOT/zookeeper-recipes-3.6.0-SNAPSHOT.pom
[JENKINS] Archiving <https://builds.apache.org/job/PreCommit-ZOOKEEPER-github-pr-build-maven/ws/zookeeper-client/zookeeper-client-c/pom.xml>
to org.apache.zookeeper/zookeeper-client-c/3.6.0-SNAPSHOT/zookeeper-client-c-3.6.0-SNAPSHOT.pom
[JENKINS] Archiving <https://builds.apache.org/job/PreCommit-ZOOKEEPER-github-pr-build-maven/ws/zookeeper-contrib/zookeeper-contrib-rest/pom.xml>
to org.apache.zookeeper/zookeeper-contrib-rest/3.6.0-SNAPSHOT/zookeeper-contrib-rest-3.6.0-SNAPSHOT.pom
[JENKINS] Archiving <https://builds.apache.org/job/PreCommit-ZOOKEEPER-github-pr-build-maven/ws/zookeeper-assembly/pom.xml>
to org.apache.zookeeper/zookeeper-assembly/3.6.0-SNAPSHOT/zookeeper-assembly-3.6.0-SNAPSHOT.pom
[JENKINS] Archiving <https://builds.apache.org/job/PreCommit-ZOOKEEPER-github-pr-build-maven/ws/zookeeper-contrib/zookeeper-contrib-zooinspector/pom.xml>
to org.apache.zookeeper/zookeeper-contrib-zooinspector/3.6.0-SNAPSHOT/zookeeper-contrib-zooinspector-3.6.0-SNAPSHOT.pom
channel stopped
[SpotBugs] Skipping execution of recorder since overall result is 'FAILURE'
Setting status of 57f596635a68eaa56a94460e54cc0a1be13c86ce to FAILURE with url https://builds.apache.org/job/PreCommit-ZOOKEEPER-github-pr-build-maven/838/
and message: 'FAILURE
 '
Using context: JenkinsMaven

Mime
View raw message