zookeeper-dev mailing list archives

Site index · List index
Message view « Date » · « Thread »
Top « Date » · « Thread »
From Apache Jenkins Server <jenk...@builds.apache.org>
Subject ZooKeeper_branch34_openjdk7 - Build # 2293 - Failure
Date Thu, 02 May 2019 16:48:08 GMT
See https://builds.apache.org/job/ZooKeeper_branch34_openjdk7/2293/

###################################################################################
########################## LAST 60 LINES OF THE CONSOLE ###########################
[...truncated 47.57 KB...]
    [junit] Running org.apache.zookeeper.test.SaslAuthFailNotifyTest
    [junit] Tests run: 1, Failures: 0, Errors: 0, Skipped: 0, Time elapsed: 1.201 sec
    [junit] Running org.apache.zookeeper.test.SaslAuthFailTest
    [junit] Tests run: 1, Failures: 0, Errors: 0, Skipped: 0, Time elapsed: 1.339 sec
    [junit] Running org.apache.zookeeper.test.SaslAuthMissingClientConfigTest
    [junit] Tests run: 1, Failures: 0, Errors: 0, Skipped: 0, Time elapsed: 1.106 sec
    [junit] Running org.apache.zookeeper.test.SaslClientTest
    [junit] Tests run: 1, Failures: 0, Errors: 0, Skipped: 0, Time elapsed: 0.183 sec
    [junit] Running org.apache.zookeeper.test.SessionInvalidationTest
    [junit] Tests run: 1, Failures: 0, Errors: 0, Skipped: 0, Time elapsed: 1.492 sec
    [junit] Running org.apache.zookeeper.test.SessionTest
    [junit] Tests run: 5, Failures: 0, Errors: 0, Skipped: 0, Time elapsed: 11.815 sec
    [junit] Running org.apache.zookeeper.test.SessionTimeoutTest
    [junit] Tests run: 4, Failures: 0, Errors: 0, Skipped: 0, Time elapsed: 2.3 sec
    [junit] Running org.apache.zookeeper.test.StandaloneTest
    [junit] Tests run: 1, Failures: 0, Errors: 0, Skipped: 0, Time elapsed: 1.55 sec
    [junit] Running org.apache.zookeeper.test.StatTest
    [junit] Tests run: 4, Failures: 0, Errors: 0, Skipped: 0, Time elapsed: 1.922 sec
    [junit] Running org.apache.zookeeper.test.StaticHostProviderTest
    [junit] Tests run: 13, Failures: 0, Errors: 0, Skipped: 0, Time elapsed: 1.813 sec
    [junit] Running org.apache.zookeeper.test.SyncCallTest
    [junit] Tests run: 1, Failures: 0, Errors: 0, Skipped: 0, Time elapsed: 1.056 sec
    [junit] Running org.apache.zookeeper.test.TruncateTest
    [junit] Tests run: 3, Failures: 0, Errors: 0, Skipped: 0, Time elapsed: 8.472 sec
    [junit] Running org.apache.zookeeper.test.UpgradeTest
    [junit] Tests run: 1, Failures: 0, Errors: 0, Skipped: 0, Time elapsed: 3.052 sec
    [junit] Running org.apache.zookeeper.test.WatchedEventTest
    [junit] Tests run: 4, Failures: 0, Errors: 0, Skipped: 0, Time elapsed: 0.195 sec
    [junit] Running org.apache.zookeeper.test.WatcherFuncTest
    [junit] Tests run: 6, Failures: 0, Errors: 0, Skipped: 0, Time elapsed: 1.994 sec
    [junit] Running org.apache.zookeeper.test.WatcherTest
    [junit] Tests run: 7, Failures: 0, Errors: 0, Skipped: 0, Time elapsed: 31.687 sec
    [junit] Running org.apache.zookeeper.test.ZkDatabaseCorruptionTest
    [junit] Tests run: 1, Failures: 0, Errors: 0, Skipped: 0, Time elapsed: 23.626 sec
    [junit] Running org.apache.zookeeper.test.ZooKeeperQuotaTest
    [junit] Tests run: 1, Failures: 0, Errors: 0, Skipped: 0, Time elapsed: 1.81 sec
    [junit] Running org.apache.jute.BinaryInputArchiveTest
    [junit] Tests run: 1, Failures: 0, Errors: 0, Skipped: 0, Time elapsed: 0.22 sec

fail.build.on.test.failure:

BUILD FAILED
/home/jenkins/jenkins-slave/workspace/ZooKeeper_branch34_openjdk7/build.xml:1425: The following
error occurred while executing this line:
/home/jenkins/jenkins-slave/workspace/ZooKeeper_branch34_openjdk7/build.xml:1428: Tests failed!

Total time: 39 minutes 53 seconds
Build step 'Invoke Ant' marked build as failure
Archiving artifacts
Setting OPENJDK_7_ON_UBUNTU_ONLY__HOME=/usr/lib/jvm/java-7-openjdk-amd64/
Recording test results
Setting OPENJDK_7_ON_UBUNTU_ONLY__HOME=/usr/lib/jvm/java-7-openjdk-amd64/
Setting OPENJDK_7_ON_UBUNTU_ONLY__HOME=/usr/lib/jvm/java-7-openjdk-amd64/
Setting OPENJDK_7_ON_UBUNTU_ONLY__HOME=/usr/lib/jvm/java-7-openjdk-amd64/
Email was triggered for: Failure - Any
Sending email for trigger: Failure - Any
Setting OPENJDK_7_ON_UBUNTU_ONLY__HOME=/usr/lib/jvm/java-7-openjdk-amd64/
Setting OPENJDK_7_ON_UBUNTU_ONLY__HOME=/usr/lib/jvm/java-7-openjdk-amd64/
Setting OPENJDK_7_ON_UBUNTU_ONLY__HOME=/usr/lib/jvm/java-7-openjdk-amd64/
Setting OPENJDK_7_ON_UBUNTU_ONLY__HOME=/usr/lib/jvm/java-7-openjdk-amd64/



###################################################################################
############################## FAILED TESTS (if any) ##############################
1 tests failed.
FAILED:  org.apache.zookeeper.SaslAuthTest.testZKOperationsAfterClientSaslAuthFailure

Error Message:
Did not connect

Stack Trace:
java.util.concurrent.TimeoutException: Did not connect
	at org.apache.zookeeper.test.ClientBase$CountdownWatcher.waitForConnected(ClientBase.java:152)
	at org.apache.zookeeper.SaslAuthTest.testZKOperationsAfterClientSaslAuthFailure(SaslAuthTest.java:174)
	at org.apache.zookeeper.JUnit4ZKTestRunner$LoggedInvokeMethod.evaluate(JUnit4ZKTestRunner.java:55)
Mime
  • Unnamed multipart/mixed (inline, None, 0 bytes)
View raw message