zookeeper-dev mailing list archives

Site index · List index
Message view « Date » · « Thread »
Top « Date » · « Thread »
From Apache Jenkins Server <jenk...@builds.apache.org>
Subject ZooKeeper-trunk - Build # 548 - Failure
Date Fri, 31 May 2019 20:49:38 GMT
See https://builds.apache.org/job/ZooKeeper-trunk/548/

###################################################################################
########################## LAST 60 LINES OF THE CONSOLE ###########################
[...truncated 309.44 KB...]
     [exec] ZooKeeper JMX enabled by default
     [exec] Using config: /home/jenkins/jenkins-slave/workspace/ZooKeeper-trunk/zookeeper-client/zookeeper-client-c/../../build/test/test-cppunit/conf/0.conf
     [exec] ZooKeeper JMX enabled by default
     [exec] Using config: /home/jenkins/jenkins-slave/workspace/ZooKeeper-trunk/zookeeper-client/zookeeper-client-c/../../build/test/test-cppunit/conf/1.conf
     [exec] ZooKeeper JMX enabled by default
     [exec] Using config: /home/jenkins/jenkins-slave/workspace/ZooKeeper-trunk/zookeeper-client/zookeeper-client-c/../../build/test/test-cppunit/conf/2.conf
     [exec] ZooKeeper JMX enabled by default
     [exec] Using config: /home/jenkins/jenkins-slave/workspace/ZooKeeper-trunk/zookeeper-client/zookeeper-client-c/../../build/test/test-cppunit/conf/0.conf
     [exec] ZooKeeper JMX enabled by default
     [exec] Using config: /home/jenkins/jenkins-slave/workspace/ZooKeeper-trunk/zookeeper-client/zookeeper-client-c/../../build/test/test-cppunit/conf/1.conf
     [exec] ZooKeeper JMX enabled by default
     [exec] Using config: /home/jenkins/jenkins-slave/workspace/ZooKeeper-trunk/zookeeper-client/zookeeper-client-c/../../build/test/test-cppunit/conf/0.conf
     [exec] ZooKeeper JMX enabled by default
     [exec] Using config: /home/jenkins/jenkins-slave/workspace/ZooKeeper-trunk/zookeeper-client/zookeeper-client-c/../../build/test/test-cppunit/conf/1.conf
     [exec] ZooKeeper JMX enabled by default
     [exec] Using config: /home/jenkins/jenkins-slave/workspace/ZooKeeper-trunk/zookeeper-client/zookeeper-client-c/../../build/test/test-cppunit/conf/2.conf
     [exec] Stopping zookeeper ... STOPPED
     [exec] ZooKeeper JMX enabled by default
     [exec] Using config: /home/jenkins/jenkins-slave/workspace/ZooKeeper-trunk/zookeeper-client/zookeeper-client-c/../../build/test/test-cppunit/conf/0.conf
     [exec] Stopping zookeeper ... STOPPED
     [exec] Stopping zookeeper ... STOPPED
     [exec]  : elapsed 8186 : OK
     [exec] ZooKeeper JMX enabled by default
     [exec] Using config: /home/jenkins/jenkins-slave/workspace/ZooKeeper-trunk/zookeeper-client/zookeeper-client-c/../../build/test/test-cppunit/conf/1.conf
     [exec] ZooKeeper JMX enabled by default
     [exec] Using config: /home/jenkins/jenkins-slave/workspace/ZooKeeper-trunk/zookeeper-client/zookeeper-client-c/../../build/test/test-cppunit/conf/2.conf
     [exec] sh: 1: Cannot fork
     [exec] zktest-mt: /home/jenkins/jenkins-slave/workspace/ZooKeeper-trunk/zookeeper-client/zookeeper-client-c/tests/ZooKeeperQuorumServer.cc:113:
void ZooKeeperQuorumServer::createConfigFile(std::string): Assertion `system(command.c_str())
== 0' failed.
     [exec] /bin/bash: line 5:  2723 Aborted                 ZKROOT=/home/jenkins/jenkins-slave/workspace/ZooKeeper-trunk/zookeeper-client/zookeeper-client-c/../..
CLASSPATH=$CLASSPATH:$CLOVER_HOME/lib/clover*.jar ${dir}$tst
     [exec] /bin/bash: fork: retry: No child processes
     [exec] /bin/bash: fork: retry: No child processes
     [exec] /bin/bash: fork: retry: No child processes
     [exec] TestReconfigServer::testReconfigFailureWithoutAuthFAIL: zktest-mt
     [exec] /bin/bash: fork: retry: Resource temporarily unavailable
     [exec] /bin/bash: fork: retry: No child processes
     [exec] /bin/bash: fork: retry: Resource temporarily unavailable
     [exec] /bin/bash: fork: retry: No child processes
     [exec] ==========================================
     [exec] 1 of 2 tests failed
     [exec] Please report to user@zookeeper.apache.org
     [exec] ==========================================
     [exec] make[1]: Leaving directory `/home/jenkins/jenkins-slave/workspace/ZooKeeper-trunk/build/test/test-cppunit'
     [exec] make[1]: *** [check-TESTS] Error 1
     [exec] make: *** [check-am] Error 2

BUILD FAILED
/home/jenkins/jenkins-slave/workspace/ZooKeeper-trunk/build.xml:1489: The following error
occurred while executing this line:
/home/jenkins/jenkins-slave/workspace/ZooKeeper-trunk/build.xml:1449: The following error
occurred while executing this line:
/home/jenkins/jenkins-slave/workspace/ZooKeeper-trunk/build.xml:1459: exec returned: 2

Total time: 27 minutes 31 seconds
Build step 'Execute shell' marked build as failure
[FINDBUGS] Skipping publisher since build result is FAILURE
[WARNINGS] Skipping publisher since build result is FAILURE
Archiving artifacts
[JIRA] Updating issue ZOOKEEPER-1426
Recording test results
Email was triggered for: Failure - Any
Sending email for trigger: Failure - Any



###################################################################################
############################## FAILED TESTS (if any) ##############################
All tests passed
Mime
  • Unnamed multipart/mixed (inline, None, 0 bytes)
View raw message