zookeeper-dev mailing list archives

Site index · List index
Message view « Date » · « Thread »
Top « Date » · « Thread »
From Apache Jenkins Server <jenk...@builds.apache.org>
Subject ZooKeeper-trunk - Build # 485 - Still Failing
Date Thu, 18 Apr 2019 23:52:02 GMT
See https://builds.apache.org/job/ZooKeeper-trunk/485/

###################################################################################
########################## LAST 60 LINES OF THE CONSOLE ###########################
[...truncated 2.78 KB...]
          inet6 addr: fe80::92b1:1cff:fe3a:f15e/64 Scope:Link
          UP BROADCAST RUNNING MULTICAST  MTU:1500  Metric:1
          RX packets:1254628106 errors:0 dropped:17 overruns:0 frame:0
          TX packets:619761302 errors:0 dropped:0 overruns:0 carrier:0
          collisions:0 txqueuelen:1000 
          RX bytes:1388466720773 (1.3 TB)  TX bytes:553191413394 (553.1 GB)
          Interrupt:16 

eno2      Link encap:Ethernet  HWaddr 90:b1:1c:3a:f1:5f  
          BROADCAST MULTICAST  MTU:1500  Metric:1
          RX packets:0 errors:0 dropped:0 overruns:0 frame:0
          TX packets:0 errors:0 dropped:0 overruns:0 carrier:0
          collisions:0 txqueuelen:1000 
          RX bytes:0 (0.0 B)  TX bytes:0 (0.0 B)
          Interrupt:17 

lo        Link encap:Local Loopback  
          inet addr:127.0.0.1  Mask:255.0.0.0
          inet6 addr: ::1/128 Scope:Host
          UP LOOPBACK RUNNING  MTU:65536  Metric:1
          RX packets:3052426574 errors:0 dropped:0 overruns:0 frame:0
          TX packets:3052426574 errors:0 dropped:0 overruns:0 carrier:0
          collisions:0 txqueuelen:1 
          RX bytes:2296106484675 (2.2 TB)  TX bytes:2296106484675 (2.2 TB)

core file size          (blocks, -c) 0
data seg size           (kbytes, -d) unlimited
scheduling priority             (-e) 0
file size               (blocks, -f) unlimited
pending signals                 (-i) 386407
max locked memory       (kbytes, -l) 64
max memory size         (kbytes, -m) unlimited
open files                      (-n) 60000
pipe size            (512 bytes, -p) 8
POSIX message queues     (bytes, -q) 819200
real-time priority              (-r) 0
stack size              (kbytes, -s) 8192
cpu time               (seconds, -t) unlimited
max user processes              (-u) 10240
virtual memory          (kbytes, -v) unlimited
file locks                      (-x) unlimited
60000
/home/jenkins/tools/ant/apache-ant-1.9.9/bin/ant clean
/tmp/jenkins6341320282218194223.sh: line 44: /home/jenkins/tools/ant/apache-ant-1.9.9/bin/ant:
No such file or directory
/tmp/jenkins6341320282218194223.sh: line 21: /home/jenkins/tools/ant/apache-ant-1.9.9/bin/ant:
No such file or directory
mv: cannot stat 'build/*.tar.gz': No such file or directory
mv: cannot stat 'build/*.jar': No such file or directory
mv: cannot stat 'build/test/findbugs': No such file or directory
mv: cannot stat 'build/docs/api': No such file or directory
mv: cannot stat 'build/test/logs': No such file or directory
Build Failed
Build step 'Execute shell' marked build as failure
[FINDBUGS] Skipping publisher since build result is FAILURE
[WARNINGS] Skipping publisher since build result is FAILURE
Archiving artifacts
Recording test results
ERROR: Step ?Publish JUnit test result report? failed: No test report files were found. Configuration
error?
Email was triggered for: Failure - Any
Sending email for trigger: Failure - Any



###################################################################################
############################## FAILED TESTS (if any) ##############################
No tests ran.
Mime
  • Unnamed multipart/mixed (inline, None, 0 bytes)
View raw message