zookeeper-dev mailing list archives

Site index · List index
Message view « Date » · « Thread »
Top « Date » · « Thread »
From Apache Jenkins Server <jenk...@builds.apache.org>
Subject ZooKeeper-trunk - Build # 476 - Failure
Date Sun, 14 Apr 2019 14:29:25 GMT
See https://builds.apache.org/job/ZooKeeper-trunk/476/

###################################################################################
########################## LAST 60 LINES OF THE CONSOLE ###########################
[...truncated 24.74 KB...]
    [javac]     PREP_PROCESS_TIME(new AvgMinMaxCounter("prep_process_time")),
    [javac]                                            ^
    [javac] /home/jenkins/jenkins-slave/workspace/ZooKeeper-trunk/zookeeper-server/src/main/java/org/apache/zookeeper/server/ServerMetrics.java:177:
error: <identifier> expected
    [javac]     PREP_PROCESS_TIME(new AvgMinMaxCounter("prep_process_time")),
    [javac]                                                               ^
    [javac] /home/jenkins/jenkins-slave/workspace/ZooKeeper-trunk/zookeeper-server/src/main/java/org/apache/zookeeper/server/ServerMetrics.java:177:
error: ';' expected
    [javac]     PREP_PROCESS_TIME(new AvgMinMaxCounter("prep_process_time")),
    [javac]                                                                ^
    [javac] /home/jenkins/jenkins-slave/workspace/ZooKeeper-trunk/zookeeper-server/src/main/java/org/apache/zookeeper/server/ServerMetrics.java:177:
error: illegal start of type
    [javac]     PREP_PROCESS_TIME(new AvgMinMaxCounter("prep_process_time")),
    [javac]                                                                 ^
    [javac] /home/jenkins/jenkins-slave/workspace/ZooKeeper-trunk/zookeeper-server/src/main/java/org/apache/zookeeper/server/ServerMetrics.java:178:
error: illegal start of type
    [javac]     CLOSE_SESSION_PREP_TIME(new AvgMinMaxPercentileCounter("close_session_prep_time")),
    [javac]                             ^
    [javac] /home/jenkins/jenkins-slave/workspace/ZooKeeper-trunk/zookeeper-server/src/main/java/org/apache/zookeeper/server/ServerMetrics.java:178:
error: ')' expected
    [javac]     CLOSE_SESSION_PREP_TIME(new AvgMinMaxPercentileCounter("close_session_prep_time")),
    [javac]                                ^
    [javac] /home/jenkins/jenkins-slave/workspace/ZooKeeper-trunk/zookeeper-server/src/main/java/org/apache/zookeeper/server/ServerMetrics.java:178:
error: ';' expected
    [javac]     CLOSE_SESSION_PREP_TIME(new AvgMinMaxPercentileCounter("close_session_prep_time")),
    [javac]                                                           ^
    [javac] /home/jenkins/jenkins-slave/workspace/ZooKeeper-trunk/zookeeper-server/src/main/java/org/apache/zookeeper/server/ServerMetrics.java:178:
error: illegal start of type
    [javac]     CLOSE_SESSION_PREP_TIME(new AvgMinMaxPercentileCounter("close_session_prep_time")),
    [javac]                                                            ^
    [javac] /home/jenkins/jenkins-slave/workspace/ZooKeeper-trunk/zookeeper-server/src/main/java/org/apache/zookeeper/server/ServerMetrics.java:178:
error: <identifier> expected
    [javac]     CLOSE_SESSION_PREP_TIME(new AvgMinMaxPercentileCounter("close_session_prep_time")),
    [javac]                                                                              
      ^
    [javac] /home/jenkins/jenkins-slave/workspace/ZooKeeper-trunk/zookeeper-server/src/main/java/org/apache/zookeeper/server/ServerMetrics.java:178:
error: ';' expected
    [javac]     CLOSE_SESSION_PREP_TIME(new AvgMinMaxPercentileCounter("close_session_prep_time")),
    [javac]                                                                              
       ^
    [javac] /home/jenkins/jenkins-slave/workspace/ZooKeeper-trunk/zookeeper-server/src/main/java/org/apache/zookeeper/server/ServerMetrics.java:178:
error: illegal start of type
    [javac]     CLOSE_SESSION_PREP_TIME(new AvgMinMaxPercentileCounter("close_session_prep_time")),
    [javac]                                                                              
        ^
    [javac] /home/jenkins/jenkins-slave/workspace/ZooKeeper-trunk/zookeeper-server/src/main/java/org/apache/zookeeper/server/ServerMetrics.java:178:
error: <identifier> expected
    [javac]     CLOSE_SESSION_PREP_TIME(new AvgMinMaxPercentileCounter("close_session_prep_time")),
    [javac]                                                                              
         ^
    [javac] /home/jenkins/jenkins-slave/workspace/ZooKeeper-trunk/zookeeper-server/src/main/java/org/apache/zookeeper/server/ServerMetrics.java:184:
error: ';' expected
    [javac]     public final Summary NODE_CREATED_WATCHER;
    [javac]           ^
    [javac] 52 errors

BUILD FAILED
/home/jenkins/jenkins-slave/workspace/ZooKeeper-trunk/build.xml:505: Compile failed; see the
compiler error output for details.

Total time: 6 seconds
mv: cannot stat 'build/*.tar.gz': No such file or directory
mv: cannot stat 'build/*.jar': No such file or directory
mv: cannot stat 'build/test/findbugs': No such file or directory
mv: cannot stat 'build/docs/api': No such file or directory
mv: cannot stat 'build/test/logs': No such file or directory
Build Failed
Build step 'Execute shell' marked build as failure
[FINDBUGS] Skipping publisher since build result is FAILURE
[WARNINGS] Skipping publisher since build result is FAILURE
Archiving artifacts
[JIRA] Updating issue ZOOKEEPER-3310
Recording test results
ERROR: Step ?Publish JUnit test result report? failed: No test report files were found. Configuration
error?
Email was triggered for: Failure - Any
Sending email for trigger: Failure - Any



###################################################################################
############################## FAILED TESTS (if any) ##############################
No tests ran.
Mime
  • Unnamed multipart/mixed (inline, None, 0 bytes)
View raw message