zookeeper-dev mailing list archives

Site index · List index
Message view « Date » · « Thread »
Top « Date » · « Thread »
From Apache Jenkins Server <jenk...@builds.apache.org>
Subject ZooKeeper_branch34_openjdk8 - Build # 265 - Failure
Date Sat, 16 Mar 2019 11:35:55 GMT
See https://builds.apache.org/job/ZooKeeper_branch34_openjdk8/265/

###################################################################################
########################## LAST 60 LINES OF THE CONSOLE ###########################
[...truncated 44.37 KB...]
    [junit] Tests run: 1, Failures: 0, Errors: 0, Skipped: 0, Time elapsed: 0.543 sec
    [junit] Running org.apache.zookeeper.test.SaslAuthFailTest
    [junit] Tests run: 1, Failures: 0, Errors: 0, Skipped: 0, Time elapsed: 1.555 sec
    [junit] Running org.apache.zookeeper.test.SaslAuthMissingClientConfigTest
    [junit] Tests run: 1, Failures: 0, Errors: 0, Skipped: 0, Time elapsed: 0.571 sec
    [junit] Running org.apache.zookeeper.test.SaslClientTest
    [junit] Tests run: 1, Failures: 0, Errors: 0, Skipped: 0, Time elapsed: 0.079 sec
    [junit] Running org.apache.zookeeper.test.SessionInvalidationTest
    [junit] Tests run: 1, Failures: 0, Errors: 0, Skipped: 0, Time elapsed: 0.695 sec
    [junit] Running org.apache.zookeeper.test.SessionTest
    [junit] Tests run: 5, Failures: 0, Errors: 0, Skipped: 0, Time elapsed: 11.216 sec
    [junit] Running org.apache.zookeeper.test.SessionTimeoutTest
    [junit] Tests run: 4, Failures: 0, Errors: 0, Skipped: 0, Time elapsed: 0.888 sec
    [junit] Running org.apache.zookeeper.test.StandaloneTest
    [junit] Tests run: 1, Failures: 0, Errors: 0, Skipped: 0, Time elapsed: 0.955 sec
    [junit] Running org.apache.zookeeper.test.StatTest
    [junit] Tests run: 4, Failures: 0, Errors: 0, Skipped: 0, Time elapsed: 0.915 sec
    [junit] Running org.apache.zookeeper.test.StaticHostProviderTest
    [junit] Tests run: 13, Failures: 0, Errors: 0, Skipped: 0, Time elapsed: 1.707 sec
    [junit] Running org.apache.zookeeper.test.SyncCallTest
    [junit] Tests run: 1, Failures: 0, Errors: 0, Skipped: 0, Time elapsed: 0.663 sec
    [junit] Running org.apache.zookeeper.test.TruncateTest
    [junit] Tests run: 3, Failures: 0, Errors: 0, Skipped: 0, Time elapsed: 9.516 sec
    [junit] Running org.apache.zookeeper.test.UpgradeTest
    [junit] Tests run: 1, Failures: 0, Errors: 0, Skipped: 0, Time elapsed: 0.938 sec
    [junit] Running org.apache.zookeeper.test.WatchedEventTest
    [junit] Tests run: 4, Failures: 0, Errors: 0, Skipped: 0, Time elapsed: 0.087 sec
    [junit] Running org.apache.zookeeper.test.WatcherFuncTest
    [junit] Tests run: 6, Failures: 0, Errors: 0, Skipped: 0, Time elapsed: 1.37 sec
    [junit] Running org.apache.zookeeper.test.WatcherTest
    [junit] Tests run: 7, Failures: 0, Errors: 1, Skipped: 0, Time elapsed: 37.377 sec
    [junit] Test org.apache.zookeeper.test.WatcherTest FAILED
    [junit] Running org.apache.zookeeper.test.ZkDatabaseCorruptionTest
    [junit] Tests run: 1, Failures: 0, Errors: 0, Skipped: 0, Time elapsed: 11.843 sec
    [junit] Running org.apache.zookeeper.test.ZooKeeperQuotaTest
    [junit] Tests run: 1, Failures: 0, Errors: 0, Skipped: 0, Time elapsed: 1.189 sec
    [junit] Running org.apache.jute.BinaryInputArchiveTest
    [junit] Tests run: 1, Failures: 0, Errors: 0, Skipped: 0, Time elapsed: 0.079 sec

fail.build.on.test.failure:

BUILD FAILED
/home/jenkins/jenkins-slave/workspace/ZooKeeper_branch34_openjdk8/build.xml:1425: The following
error occurred while executing this line:
/home/jenkins/jenkins-slave/workspace/ZooKeeper_branch34_openjdk8/build.xml:1428: Tests failed!

Total time: 42 minutes 20 seconds
Build step 'Invoke Ant' marked build as failure
Archiving artifacts
Setting OPENJDK_8_ON_UBUNTU_ONLY__HOME=/usr/lib/jvm/java-8-openjdk-amd64/
Recording test results
Setting OPENJDK_8_ON_UBUNTU_ONLY__HOME=/usr/lib/jvm/java-8-openjdk-amd64/
Setting OPENJDK_8_ON_UBUNTU_ONLY__HOME=/usr/lib/jvm/java-8-openjdk-amd64/
Setting OPENJDK_8_ON_UBUNTU_ONLY__HOME=/usr/lib/jvm/java-8-openjdk-amd64/
Email was triggered for: Failure - Any
Sending email for trigger: Failure - Any
Setting OPENJDK_8_ON_UBUNTU_ONLY__HOME=/usr/lib/jvm/java-8-openjdk-amd64/
Setting OPENJDK_8_ON_UBUNTU_ONLY__HOME=/usr/lib/jvm/java-8-openjdk-amd64/
Setting OPENJDK_8_ON_UBUNTU_ONLY__HOME=/usr/lib/jvm/java-8-openjdk-amd64/
Setting OPENJDK_8_ON_UBUNTU_ONLY__HOME=/usr/lib/jvm/java-8-openjdk-amd64/



###################################################################################
############################## FAILED TESTS (if any) ##############################
5 tests failed.
FAILED:  org.apache.zookeeper.server.PurgeTxnTest.testPurge

Error Message:
KeeperErrorCode = ConnectionLoss for /invalidsnap-1268

Stack Trace:
org.apache.zookeeper.KeeperException$ConnectionLossException: KeeperErrorCode = ConnectionLoss
for /invalidsnap-1268
	at org.apache.zookeeper.KeeperException.create(KeeperException.java:102)
	at org.apache.zookeeper.KeeperException.create(KeeperException.java:54)
	at org.apache.zookeeper.ZooKeeper.create(ZooKeeper.java:800)
	at org.apache.zookeeper.server.PurgeTxnTest.testPurge(PurgeTxnTest.java:86)
	at org.apache.zookeeper.JUnit4ZKTestRunner$LoggedInvokeMethod.evaluate(JUnit4ZKTestRunner.java:55)


FAILED:  org.apache.zookeeper.server.PurgeTxnTest.testPurgeDoesNotDeleteOverlappingLogFile

Error Message:
Address already in use

Stack Trace:
java.net.BindException: Address already in use
	at sun.nio.ch.Net.bind0(Native Method)
	at sun.nio.ch.Net.bind(Net.java:433)
	at sun.nio.ch.Net.bind(Net.java:425)
	at sun.nio.ch.ServerSocketChannelImpl.bind(ServerSocketChannelImpl.java:223)
	at sun.nio.ch.ServerSocketAdaptor.bind(ServerSocketAdaptor.java:74)
	at sun.nio.ch.ServerSocketAdaptor.bind(ServerSocketAdaptor.java:67)
	at org.apache.zookeeper.server.NIOServerCnxnFactory.configure(NIOServerCnxnFactory.java:90)
	at org.apache.zookeeper.server.ServerCnxnFactory.createFactory(ServerCnxnFactory.java:137)
	at org.apache.zookeeper.server.ServerCnxnFactory.createFactory(ServerCnxnFactory.java:130)
	at org.apache.zookeeper.server.PurgeTxnTest.testPurgeDoesNotDeleteOverlappingLogFile(PurgeTxnTest.java:460)
	at org.apache.zookeeper.JUnit4ZKTestRunner$LoggedInvokeMethod.evaluate(JUnit4ZKTestRunner.java:55)


FAILED:  org.apache.zookeeper.server.PurgeTxnTest.testPurgeWhenLogRollingInProgress

Error Message:
Address already in use

Stack Trace:
java.net.BindException: Address already in use
	at sun.nio.ch.Net.bind0(Native Method)
	at sun.nio.ch.Net.bind(Net.java:433)
	at sun.nio.ch.Net.bind(Net.java:425)
	at sun.nio.ch.ServerSocketChannelImpl.bind(ServerSocketChannelImpl.java:223)
	at sun.nio.ch.ServerSocketAdaptor.bind(ServerSocketAdaptor.java:74)
	at sun.nio.ch.ServerSocketAdaptor.bind(ServerSocketAdaptor.java:67)
	at org.apache.zookeeper.server.NIOServerCnxnFactory.configure(NIOServerCnxnFactory.java:90)
	at org.apache.zookeeper.server.ServerCnxnFactory.createFactory(ServerCnxnFactory.java:137)
	at org.apache.zookeeper.server.ServerCnxnFactory.createFactory(ServerCnxnFactory.java:130)
	at org.apache.zookeeper.server.PurgeTxnTest.testPurgeWhenLogRollingInProgress(PurgeTxnTest.java:126)
	at org.apache.zookeeper.JUnit4ZKTestRunner$LoggedInvokeMethod.evaluate(JUnit4ZKTestRunner.java:55)


FAILED:  org.apache.zookeeper.server.quorum.EphemeralNodeDeletionTest.testEphemeralNodeDeletion

Error Message:
After session close ephemeral node must be deleted expected null, but was:<4294967302,4294967302,1552733886009,1552733886009,0,0,0,144729266648317952,1,0,4294967302
>

Stack Trace:
junit.framework.AssertionFailedError: After session close ephemeral node must be deleted expected
null, but was:<4294967302,4294967302,1552733886009,1552733886009,0,0,0,144729266648317952,1,0,4294967302
>
	at org.apache.zookeeper.server.quorum.EphemeralNodeDeletionTest.testEphemeralNodeDeletion(EphemeralNodeDeletionTest.java:147)
	at org.apache.zookeeper.JUnit4ZKTestRunner$LoggedInvokeMethod.evaluate(JUnit4ZKTestRunner.java:55)
	at java.util.concurrent.FutureTask.run(FutureTask.java:266)
	at java.lang.Thread.run(Thread.java:748)


FAILED:  org.apache.zookeeper.test.WatcherTest.testWatcherAutoResetDisabledWithLocal

Error Message:
KeeperErrorCode = ConnectionLoss for /watchtest/child

Stack Trace:
org.apache.zookeeper.KeeperException$ConnectionLossException: KeeperErrorCode = ConnectionLoss
for /watchtest/child
	at org.apache.zookeeper.KeeperException.create(KeeperException.java:102)
	at org.apache.zookeeper.KeeperException.create(KeeperException.java:54)
	at org.apache.zookeeper.ZooKeeper.setData(ZooKeeper.java:1344)
	at org.apache.zookeeper.test.WatcherTest.testWatcherAutoReset(WatcherTest.java:301)
	at org.apache.zookeeper.test.WatcherTest.testWatcherAutoResetWithLocal(WatcherTest.java:255)
	at org.apache.zookeeper.test.WatcherTest.testWatcherAutoResetDisabledWithLocal(WatcherTest.java:268)
	at org.apache.zookeeper.JUnit4ZKTestRunner$LoggedInvokeMethod.evaluate(JUnit4ZKTestRunner.java:55)
Mime
  • Unnamed multipart/mixed (inline, None, 0 bytes)
View raw message