zookeeper-dev mailing list archives

Site index · List index
Message view « Date » · « Thread »
Top « Date » · « Thread »
From Enrico Olivelli <eolive...@gmail.com>
Subject Re: ZooKeeper_branch34_openjdk7 - Build # 2208 - Still Failing
Date Mon, 11 Feb 2019 20:44:24 GMT
Since we are going to release 3.4...

Better to take a look to this error.
Does any ring bell?
It seems a Jenkins issue


Enrico

Il giorno lun 11 feb 2019, 19:09 Apache Jenkins Server <
jenkins@builds.apache.org> ha scritto:

> See https://builds.apache.org/job/ZooKeeper_branch34_openjdk7/2208/
>
>
> ###################################################################################
> ########################## LAST 60 LINES OF THE CONSOLE
> ###########################
> [...truncated 8.72 KB...]
> hudson.plugins.git.GitException: Failed to fetch from git://
> git.apache.org/zookeeper.git
>         at hudson.plugins.git.GitSCM.fetchFrom(GitSCM.java:888)
>         at hudson.plugins.git.GitSCM.retrieveChanges(GitSCM.java:1155)
>         at hudson.plugins.git.GitSCM.checkout(GitSCM.java:1186)
>         at hudson.scm.SCM.checkout(SCM.java:504)
>         at hudson.model.AbstractProject.checkout(AbstractProject.java:1208)
>         at
> hudson.model.AbstractBuild$AbstractBuildExecution.defaultCheckout(AbstractBuild.java:574)
>         at
> jenkins.scm.SCMCheckoutStrategy.checkout(SCMCheckoutStrategy.java:86)
>         at
> hudson.model.AbstractBuild$AbstractBuildExecution.run(AbstractBuild.java:499)
>         at hudson.model.Run.execute(Run.java:1810)
>         at hudson.model.FreeStyleBuild.run(FreeStyleBuild.java:43)
>         at
> hudson.model.ResourceController.execute(ResourceController.java:97)
>         at hudson.model.Executor.run(Executor.java:429)
> Caused by: hudson.plugins.git.GitException: Command "git fetch --tags
> --progress git://git.apache.org/zookeeper.git
> +refs/heads/*:refs/remotes/origin/*" returned status code 128:
> stdout:
> stderr: fatal: remote error: access denied or repository not exported:
> /zookeeper.git
>
>         at
> org.jenkinsci.plugins.gitclient.CliGitAPIImpl.launchCommandIn(CliGitAPIImpl.java:2038)
>         at
> org.jenkinsci.plugins.gitclient.CliGitAPIImpl.launchCommandWithCredentials(CliGitAPIImpl.java:1757)
>         at
> org.jenkinsci.plugins.gitclient.CliGitAPIImpl.access$300(CliGitAPIImpl.java:72)
>         at
> org.jenkinsci.plugins.gitclient.CliGitAPIImpl$1.execute(CliGitAPIImpl.java:438)
>         at
> org.jenkinsci.plugins.gitclient.RemoteGitImpl$CommandInvocationHandler$1.call(RemoteGitImpl.java:153)
>         at
> org.jenkinsci.plugins.gitclient.RemoteGitImpl$CommandInvocationHandler$1.call(RemoteGitImpl.java:146)
>         at hudson.remoting.UserRequest.perform(UserRequest.java:212)
>         at hudson.remoting.UserRequest.perform(UserRequest.java:54)
>         at hudson.remoting.Request$2.run(Request.java:369)
>         at
> hudson.remoting.InterceptingExecutorService$1.call(InterceptingExecutorService.java:72)
>         at java.util.concurrent.FutureTask.run(FutureTask.java:266)
>         at
> java.util.concurrent.ThreadPoolExecutor.runWorker(ThreadPoolExecutor.java:1142)
>         at
> java.util.concurrent.ThreadPoolExecutor$Worker.run(ThreadPoolExecutor.java:617)
>         at java.lang.Thread.run(Thread.java:748)
>         Suppressed: hudson.remoting.Channel$CallSiteStackTrace: Remote
> call to ubuntu-eu2
>                 at
> hudson.remoting.Channel.attachCallSiteStackTrace(Channel.java:1741)
>                 at
> hudson.remoting.UserRequest$ExceptionResponse.retrieve(UserRequest.java:357)
>                 at hudson.remoting.Channel.call(Channel.java:955)
>                 at
> org.jenkinsci.plugins.gitclient.RemoteGitImpl$CommandInvocationHandler.execute(RemoteGitImpl.java:146)
>                 at sun.reflect.GeneratedMethodAccessor1141.invoke(Unknown
> Source)
>                 at
> sun.reflect.DelegatingMethodAccessorImpl.invoke(DelegatingMethodAccessorImpl.java:43)
>                 at java.lang.reflect.Method.invoke(Method.java:498)
>                 at
> org.jenkinsci.plugins.gitclient.RemoteGitImpl$CommandInvocationHandler.invoke(RemoteGitImpl.java:132)
>                 at com.sun.proxy.$Proxy115.execute(Unknown Source)
>                 at hudson.plugins.git.GitSCM.fetchFrom(GitSCM.java:886)
>                 at
> hudson.plugins.git.GitSCM.retrieveChanges(GitSCM.java:1155)
>                 at hudson.plugins.git.GitSCM.checkout(GitSCM.java:1186)
>                 at hudson.scm.SCM.checkout(SCM.java:504)
>                 at
> hudson.model.AbstractProject.checkout(AbstractProject.java:1208)
>                 at
> hudson.model.AbstractBuild$AbstractBuildExecution.defaultCheckout(AbstractBuild.java:574)
>                 at
> jenkins.scm.SCMCheckoutStrategy.checkout(SCMCheckoutStrategy.java:86)
>                 at
> hudson.model.AbstractBuild$AbstractBuildExecution.run(AbstractBuild.java:499)
>                 at hudson.model.Run.execute(Run.java:1810)
>                 at hudson.model.FreeStyleBuild.run(FreeStyleBuild.java:43)
>                 at
> hudson.model.ResourceController.execute(ResourceController.java:97)
>                 at hudson.model.Executor.run(Executor.java:429)
> ERROR: Error fetching remote repo 'origin'
> Archiving artifacts
> Recording test results
> ERROR: Step ‘Publish JUnit test result report’ failed: No test report
> files were found. Configuration error?
> Email was triggered for: Failure - Any
> Sending email for trigger: Failure - Any
>
>
>
>
> ###################################################################################
> ############################## FAILED TESTS (if any)
> ##############################
> No tests ran.

Mime
  • Unnamed multipart/alternative (inline, None, 0 bytes)
View raw message