zookeeper-dev mailing list archives

Site index · List index
Message view « Date » · « Thread »
Top « Date » · « Thread »
From Apache Jenkins Server <jenk...@builds.apache.org>
Subject ZooKeeper_branch35_jdk8 - Build # 1289 - Failure
Date Sat, 02 Feb 2019 13:25:28 GMT
See https://builds.apache.org/job/ZooKeeper_branch35_jdk8/1289/

###################################################################################
########################## LAST 60 LINES OF THE CONSOLE ###########################
[...truncated 66.91 KB...]
    [junit] Running org.apache.zookeeper.test.SaslSuperUserTest in thread 3
    [junit] Running org.apache.zookeeper.test.ServerCnxnTest in thread 2
    [junit] Tests run: 1, Failures: 0, Errors: 0, Skipped: 0, Time elapsed: 2.596 sec, Thread:
3, Class: org.apache.zookeeper.test.SaslSuperUserTest
    [junit] Running org.apache.zookeeper.test.SessionInvalidationTest in thread 3
    [junit] Tests run: 1, Failures: 0, Errors: 0, Skipped: 0, Time elapsed: 4.296 sec, Thread:
2, Class: org.apache.zookeeper.test.ServerCnxnTest
    [junit] Tests run: 1, Failures: 0, Errors: 0, Skipped: 0, Time elapsed: 1.596 sec, Thread:
3, Class: org.apache.zookeeper.test.SessionInvalidationTest
    [junit] Running org.apache.zookeeper.test.SessionTest in thread 2
    [junit] Running org.apache.zookeeper.test.SessionTimeoutTest in thread 3
    [junit] Tests run: 4, Failures: 0, Errors: 0, Skipped: 0, Time elapsed: 3.759 sec, Thread:
3, Class: org.apache.zookeeper.test.SessionTimeoutTest
    [junit] Running org.apache.zookeeper.test.SessionTrackerCheckTest in thread 3
    [junit] Tests run: 2, Failures: 0, Errors: 0, Skipped: 0, Time elapsed: 0.15 sec, Thread:
3, Class: org.apache.zookeeper.test.SessionTrackerCheckTest
    [junit] Running org.apache.zookeeper.test.SessionUpgradeTest in thread 3
    [junit] Tests run: 5, Failures: 0, Errors: 0, Skipped: 0, Time elapsed: 14.564 sec, Thread:
2, Class: org.apache.zookeeper.test.SessionTest
    [junit] Running org.apache.zookeeper.test.StandaloneTest in thread 2
    [junit] Tests run: 4, Failures: 0, Errors: 0, Skipped: 0, Time elapsed: 3.361 sec, Thread:
2, Class: org.apache.zookeeper.test.StandaloneTest
    [junit] Running org.apache.zookeeper.test.StatTest in thread 2
    [junit] Tests run: 4, Failures: 0, Errors: 0, Skipped: 0, Time elapsed: 2.29 sec, Thread:
2, Class: org.apache.zookeeper.test.StatTest
    [junit] Running org.apache.zookeeper.test.StaticHostProviderTest in thread 2
    [junit] Tests run: 26, Failures: 0, Errors: 0, Skipped: 0, Time elapsed: 3.103 sec, Thread:
2, Class: org.apache.zookeeper.test.StaticHostProviderTest
    [junit] Running org.apache.zookeeper.test.StringUtilTest in thread 2
    [junit] Tests run: 1, Failures: 0, Errors: 0, Skipped: 0, Time elapsed: 0.267 sec, Thread:
2, Class: org.apache.zookeeper.test.StringUtilTest
    [junit] Running org.apache.zookeeper.test.SyncCallTest in thread 2
    [junit] Tests run: 1, Failures: 0, Errors: 0, Skipped: 0, Time elapsed: 1.979 sec, Thread:
2, Class: org.apache.zookeeper.test.SyncCallTest
    [junit] Running org.apache.zookeeper.test.TruncateTest in thread 2
    [junit] Tests run: 4, Failures: 0, Errors: 0, Skipped: 0, Time elapsed: 30.072 sec, Thread:
3, Class: org.apache.zookeeper.test.SessionUpgradeTest
    [junit] Running org.apache.zookeeper.test.WatchEventWhenAutoResetTest in thread 3
    [junit] Tests run: 3, Failures: 0, Errors: 0, Skipped: 0, Time elapsed: 8.892 sec, Thread:
2, Class: org.apache.zookeeper.test.TruncateTest
    [junit] Running org.apache.zookeeper.test.WatchedEventTest in thread 2
    [junit] Tests run: 4, Failures: 0, Errors: 0, Skipped: 0, Time elapsed: 0.293 sec, Thread:
2, Class: org.apache.zookeeper.test.WatchedEventTest
    [junit] Running org.apache.zookeeper.test.WatcherFuncTest in thread 2
    [junit] Tests run: 103, Failures: 0, Errors: 0, Skipped: 0, Time elapsed: 440.369 sec,
Thread: 1, Class: org.apache.zookeeper.test.NioNettySuiteTest
    [junit] Tests run: 6, Failures: 0, Errors: 0, Skipped: 0, Time elapsed: 5.939 sec, Thread:
2, Class: org.apache.zookeeper.test.WatcherFuncTest
    [junit] Running org.apache.zookeeper.test.X509AuthTest in thread 2
    [junit] Running org.apache.zookeeper.test.WatcherTest in thread 1
    [junit] Tests run: 3, Failures: 0, Errors: 0, Skipped: 0, Time elapsed: 0.879 sec, Thread:
2, Class: org.apache.zookeeper.test.X509AuthTest
    [junit] Running org.apache.zookeeper.test.ZkDatabaseCorruptionTest in thread 2
    [junit] Tests run: 4, Failures: 0, Errors: 0, Skipped: 0, Time elapsed: 32.398 sec, Thread:
3, Class: org.apache.zookeeper.test.WatchEventWhenAutoResetTest
    [junit] Running org.apache.zookeeper.test.ZooKeeperQuotaTest in thread 3
    [junit] Tests run: 1, Failures: 0, Errors: 0, Skipped: 0, Time elapsed: 3.22 sec, Thread:
3, Class: org.apache.zookeeper.test.ZooKeeperQuotaTest
    [junit] Running org.apache.zookeeper.util.PemReaderTest in thread 3
    [junit] Tests run: 2, Failures: 0, Errors: 0, Skipped: 0, Time elapsed: 27.662 sec, Thread:
2, Class: org.apache.zookeeper.test.ZkDatabaseCorruptionTest
    [junit] Tests run: 64, Failures: 0, Errors: 0, Skipped: 0, Time elapsed: 6.706 sec, Thread:
3, Class: org.apache.zookeeper.util.PemReaderTest
    [junit] Running org.apache.jute.BinaryInputArchiveTest in thread 2
    [junit] Tests run: 1, Failures: 0, Errors: 0, Skipped: 0, Time elapsed: 0.156 sec, Thread:
2, Class: org.apache.jute.BinaryInputArchiveTest
    [junit] Tests run: 8, Failures: 0, Errors: 0, Skipped: 0, Time elapsed: 37.648 sec, Thread:
1, Class: org.apache.zookeeper.test.WatcherTest
    [junit] Tests run: 13, Failures: 0, Errors: 0, Skipped: 0, Time elapsed: 300.909 sec,
Thread: 4, Class: org.apache.zookeeper.test.ReconfigTest

fail.build.on.test.failure:

BUILD FAILED
/home/jenkins/jenkins-slave/workspace/ZooKeeper_branch35_jdk8/build.xml:1319: The following
error occurred while executing this line:
/home/jenkins/jenkins-slave/workspace/ZooKeeper_branch35_jdk8/build.xml:1323: Tests failed!

Total time: 27 minutes 1 second
Build step 'Invoke Ant' marked build as failure
Archiving artifacts
Recording test results
Email was triggered for: Failure - Any
Sending email for trigger: Failure - Any



###################################################################################
############################## FAILED TESTS (if any) ##############################
1 tests failed.
FAILED:  org.apache.zookeeper.server.quorum.Zab1_0Test.testNormalRun

Error Message:
expected:<1> but was:<0>

Stack Trace:
junit.framework.AssertionFailedError: expected:<1> but was:<0>
	at org.apache.zookeeper.server.quorum.Zab1_0Test$6.converseWithLeader(Zab1_0Test.java:873)
	at org.apache.zookeeper.server.quorum.Zab1_0Test.testLeaderConversation(Zab1_0Test.java:328)
	at org.apache.zookeeper.server.quorum.Zab1_0Test.testNormalRun(Zab1_0Test.java:840)
	at org.apache.zookeeper.JUnit4ZKTestRunner$LoggedInvokeMethod.evaluate(JUnit4ZKTestRunner.java:79)
Mime
  • Unnamed multipart/mixed (inline, None, 0 bytes)
View raw message