zookeeper-dev mailing list archives

Site index · List index
Message view « Date » · « Thread »
Top « Date » · « Thread »
From Apache Jenkins Server <jenk...@builds.apache.org>
Subject ZooKeeper_branch35_jdk8 - Build # 1320 - Failure
Date Tue, 26 Feb 2019 13:30:54 GMT
See https://builds.apache.org/job/ZooKeeper_branch35_jdk8/1320/

###################################################################################
########################## LAST 60 LINES OF THE CONSOLE ###########################
[...truncated 67.17 KB...]
    [junit] Running org.apache.zookeeper.test.SaslSuperUserTest in thread 2
    [junit] Running org.apache.zookeeper.test.ServerCnxnTest in thread 3
    [junit] Tests run: 1, Failures: 0, Errors: 0, Skipped: 0, Time elapsed: 0.805 sec, Thread:
2, Class: org.apache.zookeeper.test.SaslSuperUserTest
    [junit] Running org.apache.zookeeper.test.SessionInvalidationTest in thread 2
    [junit] Tests run: 1, Failures: 0, Errors: 0, Skipped: 0, Time elapsed: 0.769 sec, Thread:
2, Class: org.apache.zookeeper.test.SessionInvalidationTest
    [junit] Running org.apache.zookeeper.test.SessionTest in thread 2
    [junit] Tests run: 1, Failures: 0, Errors: 0, Skipped: 0, Time elapsed: 3.389 sec, Thread:
3, Class: org.apache.zookeeper.test.ServerCnxnTest
    [junit] Running org.apache.zookeeper.test.SessionTimeoutTest in thread 3
    [junit] Tests run: 4, Failures: 0, Errors: 0, Skipped: 0, Time elapsed: 1.911 sec, Thread:
3, Class: org.apache.zookeeper.test.SessionTimeoutTest
    [junit] Running org.apache.zookeeper.test.SessionTrackerCheckTest in thread 3
    [junit] Tests run: 2, Failures: 0, Errors: 0, Skipped: 0, Time elapsed: 0.109 sec, Thread:
3, Class: org.apache.zookeeper.test.SessionTrackerCheckTest
    [junit] Running org.apache.zookeeper.test.SessionUpgradeTest in thread 3
    [junit] Tests run: 1, Failures: 0, Errors: 0, Skipped: 0, Time elapsed: 31.054 sec, Thread:
1, Class: org.apache.zookeeper.test.RestoreCommittedLogTest
    [junit] Running org.apache.zookeeper.test.StandaloneTest in thread 1
    [junit] Tests run: 4, Failures: 0, Errors: 0, Skipped: 0, Time elapsed: 2.703 sec, Thread:
1, Class: org.apache.zookeeper.test.StandaloneTest
    [junit] Running org.apache.zookeeper.test.StatTest in thread 1
    [junit] Tests run: 4, Failures: 0, Errors: 0, Skipped: 0, Time elapsed: 2.066 sec, Thread:
1, Class: org.apache.zookeeper.test.StatTest
    [junit] Running org.apache.zookeeper.test.StaticHostProviderTest in thread 1
    [junit] Tests run: 5, Failures: 0, Errors: 0, Skipped: 0, Time elapsed: 13.558 sec, Thread:
2, Class: org.apache.zookeeper.test.SessionTest
    [junit] Running org.apache.zookeeper.test.StringUtilTest in thread 2
    [junit] Tests run: 1, Failures: 0, Errors: 0, Skipped: 0, Time elapsed: 0.071 sec, Thread:
2, Class: org.apache.zookeeper.test.StringUtilTest
    [junit] Tests run: 26, Failures: 0, Errors: 0, Skipped: 0, Time elapsed: 1.745 sec, Thread:
1, Class: org.apache.zookeeper.test.StaticHostProviderTest
    [junit] Running org.apache.zookeeper.test.SyncCallTest in thread 2
    [junit] Running org.apache.zookeeper.test.TruncateTest in thread 1
    [junit] Tests run: 1, Failures: 0, Errors: 0, Skipped: 0, Time elapsed: 0.903 sec, Thread:
2, Class: org.apache.zookeeper.test.SyncCallTest
    [junit] Running org.apache.zookeeper.test.WatchEventWhenAutoResetTest in thread 2
    [junit] Tests run: 4, Failures: 0, Errors: 0, Skipped: 0, Time elapsed: 21.302 sec, Thread:
3, Class: org.apache.zookeeper.test.SessionUpgradeTest
    [junit] Tests run: 3, Failures: 0, Errors: 0, Skipped: 0, Time elapsed: 11.445 sec, Thread:
1, Class: org.apache.zookeeper.test.TruncateTest
    [junit] Running org.apache.zookeeper.test.WatchedEventTest in thread 3
    [junit] Tests run: 4, Failures: 0, Errors: 0, Skipped: 0, Time elapsed: 0.084 sec, Thread:
3, Class: org.apache.zookeeper.test.WatchedEventTest
    [junit] Running org.apache.zookeeper.test.WatcherFuncTest in thread 1
    [junit] Running org.apache.zookeeper.test.WatcherTest in thread 3
    [junit] Tests run: 6, Failures: 0, Errors: 0, Skipped: 0, Time elapsed: 3.655 sec, Thread:
1, Class: org.apache.zookeeper.test.WatcherFuncTest
    [junit] Running org.apache.zookeeper.test.X509AuthTest in thread 1
    [junit] Tests run: 3, Failures: 0, Errors: 0, Skipped: 0, Time elapsed: 0.376 sec, Thread:
1, Class: org.apache.zookeeper.test.X509AuthTest
    [junit] Running org.apache.zookeeper.test.ZkDatabaseCorruptionTest in thread 1
    [junit] Tests run: 4, Failures: 0, Errors: 0, Skipped: 0, Time elapsed: 21.328 sec, Thread:
2, Class: org.apache.zookeeper.test.WatchEventWhenAutoResetTest
    [junit] Running org.apache.zookeeper.test.ZooKeeperQuotaTest in thread 2
    [junit] Tests run: 1, Failures: 0, Errors: 0, Skipped: 0, Time elapsed: 1.265 sec, Thread:
2, Class: org.apache.zookeeper.test.ZooKeeperQuotaTest
    [junit] Running org.apache.zookeeper.util.PemReaderTest in thread 2
    [junit] Tests run: 64, Failures: 0, Errors: 0, Skipped: 0, Time elapsed: 2.941 sec, Thread:
2, Class: org.apache.zookeeper.util.PemReaderTest
    [junit] Running org.apache.jute.BinaryInputArchiveTest in thread 2
    [junit] Tests run: 2, Failures: 0, Errors: 0, Skipped: 0, Time elapsed: 12.659 sec, Thread:
1, Class: org.apache.zookeeper.test.ZkDatabaseCorruptionTest
    [junit] Tests run: 1, Failures: 0, Errors: 0, Skipped: 0, Time elapsed: 0.077 sec, Thread:
2, Class: org.apache.jute.BinaryInputArchiveTest
    [junit] Tests run: 8, Failures: 0, Errors: 0, Skipped: 0, Time elapsed: 31.937 sec, Thread:
3, Class: org.apache.zookeeper.test.WatcherTest
    [junit] Tests run: 13, Failures: 0, Errors: 0, Skipped: 0, Time elapsed: 272.625 sec,
Thread: 4, Class: org.apache.zookeeper.test.ReconfigTest

fail.build.on.test.failure:

BUILD FAILED
/home/jenkins/jenkins-slave/workspace/ZooKeeper_branch35_jdk8/build.xml:1328: The following
error occurred while executing this line:
/home/jenkins/jenkins-slave/workspace/ZooKeeper_branch35_jdk8/build.xml:1332: Tests failed!

Total time: 26 minutes 20 seconds
Build step 'Invoke Ant' marked build as failure
Archiving artifacts
Recording test results
Email was triggered for: Failure - Any
Sending email for trigger: Failure - Any



###################################################################################
############################## FAILED TESTS (if any) ##############################
8 tests failed.
FAILED:  org.apache.zookeeper.test.WatcherTest.testWatchAutoResetWithPending

Error Message:
Unexpected bean exists! expected:<0> but was:<1>

Stack Trace:
junit.framework.AssertionFailedError: Unexpected bean exists! expected:<0> but was:<1>
	at org.apache.zookeeper.test.ClientBase.verifyUnexpectedBeans(ClientBase.java:566)
	at org.apache.zookeeper.test.ClientBase.startServer(ClientBase.java:545)
	at org.apache.zookeeper.test.ClientBase.setUpWithServerId(ClientBase.java:524)
	at org.apache.zookeeper.test.ClientBase.setUp(ClientBase.java:500)
	at org.apache.zookeeper.test.WatcherTest.setUp(WatcherTest.java:78)


FAILED:  org.apache.zookeeper.test.WatcherTest.testWatcherCorrectness

Error Message:
Unexpected bean exists! expected:<0> but was:<1>

Stack Trace:
junit.framework.AssertionFailedError: Unexpected bean exists! expected:<0> but was:<1>
	at org.apache.zookeeper.test.ClientBase.verifyUnexpectedBeans(ClientBase.java:566)
	at org.apache.zookeeper.test.ClientBase.startServer(ClientBase.java:545)
	at org.apache.zookeeper.test.ClientBase.setUpWithServerId(ClientBase.java:524)
	at org.apache.zookeeper.test.ClientBase.setUp(ClientBase.java:500)
	at org.apache.zookeeper.test.WatcherTest.setUp(WatcherTest.java:78)


FAILED:  org.apache.zookeeper.test.WatcherTest.testWatcherAutoResetDisabledWithLocal

Error Message:
Unexpected bean exists! expected:<0> but was:<1>

Stack Trace:
junit.framework.AssertionFailedError: Unexpected bean exists! expected:<0> but was:<1>
	at org.apache.zookeeper.test.ClientBase.verifyUnexpectedBeans(ClientBase.java:566)
	at org.apache.zookeeper.test.ClientBase.startServer(ClientBase.java:545)
	at org.apache.zookeeper.test.ClientBase.setUpWithServerId(ClientBase.java:524)
	at org.apache.zookeeper.test.ClientBase.setUp(ClientBase.java:500)
	at org.apache.zookeeper.test.WatcherTest.setUp(WatcherTest.java:78)


FAILED:  org.apache.zookeeper.test.WatcherTest.testWatcherAutoResetWithGlobal

Error Message:
Unexpected bean exists! expected:<0> but was:<1>

Stack Trace:
junit.framework.AssertionFailedError: Unexpected bean exists! expected:<0> but was:<1>
	at org.apache.zookeeper.test.ClientBase.verifyUnexpectedBeans(ClientBase.java:566)
	at org.apache.zookeeper.test.ClientBase.startServer(ClientBase.java:545)
	at org.apache.zookeeper.test.ClientBase.setUpWithServerId(ClientBase.java:524)
	at org.apache.zookeeper.test.ClientBase.setUp(ClientBase.java:500)
	at org.apache.zookeeper.test.WatcherTest.setUp(WatcherTest.java:78)


FAILED:  org.apache.zookeeper.test.WatcherTest.testWatcherDisconnectOnClose

Error Message:
Unexpected bean exists! expected:<0> but was:<1>

Stack Trace:
junit.framework.AssertionFailedError: Unexpected bean exists! expected:<0> but was:<1>
	at org.apache.zookeeper.test.ClientBase.verifyUnexpectedBeans(ClientBase.java:566)
	at org.apache.zookeeper.test.ClientBase.startServer(ClientBase.java:545)
	at org.apache.zookeeper.test.ClientBase.setUpWithServerId(ClientBase.java:524)
	at org.apache.zookeeper.test.ClientBase.setUp(ClientBase.java:500)
	at org.apache.zookeeper.test.WatcherTest.setUp(WatcherTest.java:78)


FAILED:  org.apache.zookeeper.test.WatcherTest.testWatcherCount

Error Message:
Unexpected bean exists! expected:<0> but was:<1>

Stack Trace:
junit.framework.AssertionFailedError: Unexpected bean exists! expected:<0> but was:<1>
	at org.apache.zookeeper.test.ClientBase.verifyUnexpectedBeans(ClientBase.java:566)
	at org.apache.zookeeper.test.ClientBase.startServer(ClientBase.java:545)
	at org.apache.zookeeper.test.ClientBase.setUpWithServerId(ClientBase.java:524)
	at org.apache.zookeeper.test.ClientBase.setUp(ClientBase.java:500)
	at org.apache.zookeeper.test.WatcherTest.setUp(WatcherTest.java:78)


FAILED:  org.apache.zookeeper.test.WatcherTest.testWatcherAutoResetDisabledWithGlobal

Error Message:
Unexpected bean exists! expected:<0> but was:<1>

Stack Trace:
junit.framework.AssertionFailedError: Unexpected bean exists! expected:<0> but was:<1>
	at org.apache.zookeeper.test.ClientBase.verifyUnexpectedBeans(ClientBase.java:566)
	at org.apache.zookeeper.test.ClientBase.startServer(ClientBase.java:545)
	at org.apache.zookeeper.test.ClientBase.setUpWithServerId(ClientBase.java:524)
	at org.apache.zookeeper.test.ClientBase.setUp(ClientBase.java:500)
	at org.apache.zookeeper.test.WatcherTest.setUp(WatcherTest.java:78)


FAILED:  org.apache.zookeeper.test.WatcherTest.testWatcherAutoResetWithLocal

Error Message:
Unexpected bean exists! expected:<0> but was:<1>

Stack Trace:
junit.framework.AssertionFailedError: Unexpected bean exists! expected:<0> but was:<1>
	at org.apache.zookeeper.test.ClientBase.verifyUnexpectedBeans(ClientBase.java:566)
	at org.apache.zookeeper.test.ClientBase.startServer(ClientBase.java:545)
	at org.apache.zookeeper.test.ClientBase.setUpWithServerId(ClientBase.java:524)
	at org.apache.zookeeper.test.ClientBase.setUp(ClientBase.java:500)
	at org.apache.zookeeper.test.WatcherTest.setUp(WatcherTest.java:78)
Mime
  • Unnamed multipart/mixed (inline, None, 0 bytes)
View raw message