zookeeper-dev mailing list archives

Site index · List index
Message view « Date » · « Thread »
Top « Date » · « Thread »
From Apache Jenkins Server <jenk...@builds.apache.org>
Subject ZooKeeper-trunk - Build # 353 - Failure
Date Wed, 16 Jan 2019 14:16:40 GMT
See https://builds.apache.org/job/ZooKeeper-trunk/353/

###################################################################################
########################## LAST 60 LINES OF THE CONSOLE ###########################
[...truncated 9.94 KB...]
   [javacc] (type "javacc" with no arguments for help)
   [javacc] Reading from file /home/jenkins/jenkins-slave/workspace/ZooKeeper-trunk/zookeeper-jute/src/main/java/org/apache/jute/compiler/generated/rcc.jj
. . .
   [javacc] File "TokenMgrError.java" does not exist.  Will create one.
   [javacc] File "ParseException.java" does not exist.  Will create one.
   [javacc] File "Token.java" does not exist.  Will create one.
   [javacc] File "SimpleCharStream.java" does not exist.  Will create one.
   [javacc] Parser generated successfully.

jute:
    [javac] Compiling 39 source files to /home/jenkins/jenkins-slave/workspace/ZooKeeper-trunk/build/classes

compile_jute_uptodate:

compile_jute:
    [mkdir] Created dir: /home/jenkins/jenkins-slave/workspace/ZooKeeper-trunk/zookeeper-jute/target/main/java
    [mkdir] Created dir: /home/jenkins/jenkins-slave/workspace/ZooKeeper-trunk/zookeeper-client/zookeeper-client-c/generated
     [java] ../../../src/main/resources/zookeeper.jute Parsed Successfully
     [java] ../../../zookeeper-jute/src/main/resources/zookeeper.jute Parsed Successfully
    [touch] Creating /home/jenkins/jenkins-slave/workspace/ZooKeeper-trunk/zookeeper-jute/target/main/java/.generated

ver-gen:
    [javac] Compiling 1 source file to /home/jenkins/jenkins-slave/workspace/ZooKeeper-trunk/build/classes

git-revision:
    [mkdir] Created dir: /home/jenkins/jenkins-slave/workspace/ZooKeeper-trunk/.revision

version-info:

process-template:

build-generated:
    [javac] Compiling 65 source files to /home/jenkins/jenkins-slave/workspace/ZooKeeper-trunk/build/classes

compile:
    [javac] Compiling 302 source files to /home/jenkins/jenkins-slave/workspace/ZooKeeper-trunk/build/classes
    [javac] /home/jenkins/jenkins-slave/workspace/ZooKeeper-trunk/zookeeper-server/src/main/java/org/apache/zookeeper/server/FinalRequestProcessor.java:459:
error: variable path is already defined in method processRequest(Request)
    [javac]                     for (String path: allEphems) {
    [javac]                                 ^
    [javac] 1 error

BUILD FAILED
/home/jenkins/jenkins-slave/workspace/ZooKeeper-trunk/build.xml:503: Compile failed; see the
compiler error output for details.

Total time: 8 seconds
mv: cannot stat 'build/*.tar.gz': No such file or directory
mv: cannot stat 'build/*.jar': No such file or directory
mv: cannot stat 'build/test/findbugs': No such file or directory
mv: cannot stat 'build/docs/api': No such file or directory
mv: cannot stat 'build/test/logs': No such file or directory
Build Failed
Build step 'Execute shell' marked build as failure
[FINDBUGS] Skipping publisher since build result is FAILURE
[WARNINGS] Skipping publisher since build result is FAILURE
Archiving artifacts
[JIRA] Updating issue ZOOKEEPER-3209
Recording test results
ERROR: Step ?Publish JUnit test result report? failed: No test report files were found. Configuration
error?
Email was triggered for: Failure - Any
Sending email for trigger: Failure - Any



###################################################################################
############################## FAILED TESTS (if any) ##############################
No tests ran.
Mime
  • Unnamed multipart/mixed (inline, None, 0 bytes)
View raw message