zookeeper-dev mailing list archives

Site index · List index
Message view « Date » · « Thread »
Top « Date » · « Thread »
From Apache Jenkins Server <jenk...@builds.apache.org>
Subject ZooKeeper-trunk - Build # 375 - Still Failing
Date Wed, 30 Jan 2019 19:30:11 GMT
See https://builds.apache.org/job/ZooKeeper-trunk/375/

###################################################################################
########################## LAST 60 LINES OF THE CONSOLE ###########################
[...truncated 182.68 KB...]
    [junit] Tests run: 2, Failures: 0, Errors: 0, Skipped: 0, Time elapsed: 0.092 sec, Thread:
2, Class: org.apache.zookeeper.test.SessionTrackerCheckTest
    [junit] Running org.apache.zookeeper.test.SessionUpgradeTest in thread 2
    [junit] Tests run: 6, Failures: 0, Errors: 0, Skipped: 0, Time elapsed: 15.389 sec, Thread:
3, Class: org.apache.zookeeper.test.SessionTest
    [junit] Running org.apache.zookeeper.test.StandaloneTest in thread 3
    [junit] Tests run: 4, Failures: 0, Errors: 0, Skipped: 0, Time elapsed: 2.698 sec, Thread:
3, Class: org.apache.zookeeper.test.StandaloneTest
    [junit] Running org.apache.zookeeper.test.StatTest in thread 3
    [junit] Tests run: 4, Failures: 0, Errors: 0, Skipped: 0, Time elapsed: 1.203 sec, Thread:
3, Class: org.apache.zookeeper.test.StatTest
    [junit] Running org.apache.zookeeper.test.StaticHostProviderTest in thread 3
    [junit] Tests run: 4, Failures: 0, Errors: 0, Skipped: 0, Time elapsed: 18.951 sec, Thread:
2, Class: org.apache.zookeeper.test.SessionUpgradeTest
    [junit] Tests run: 26, Failures: 0, Errors: 0, Skipped: 0, Time elapsed: 1.751 sec, Thread:
3, Class: org.apache.zookeeper.test.StaticHostProviderTest
    [junit] Running org.apache.zookeeper.test.StringUtilTest in thread 2
    [junit] Running org.apache.zookeeper.test.SyncCallTest in thread 3
    [junit] Tests run: 1, Failures: 0, Errors: 0, Skipped: 0, Time elapsed: 0.068 sec, Thread:
2, Class: org.apache.zookeeper.test.StringUtilTest
    [junit] Running org.apache.zookeeper.test.TruncateTest in thread 2
    [junit] Tests run: 1, Failures: 0, Errors: 0, Skipped: 0, Time elapsed: 0.758 sec, Thread:
3, Class: org.apache.zookeeper.test.SyncCallTest
    [junit] Running org.apache.zookeeper.test.WatchEventWhenAutoResetTest in thread 3
    [junit] Tests run: 3, Failures: 0, Errors: 0, Skipped: 0, Time elapsed: 6.027 sec, Thread:
2, Class: org.apache.zookeeper.test.TruncateTest
    [junit] Running org.apache.zookeeper.test.WatchedEventTest in thread 2
    [junit] Tests run: 4, Failures: 0, Errors: 0, Skipped: 0, Time elapsed: 0.085 sec, Thread:
2, Class: org.apache.zookeeper.test.WatchedEventTest
    [junit] Running org.apache.zookeeper.test.WatcherFuncTest in thread 2
    [junit] Tests run: 6, Failures: 0, Errors: 0, Skipped: 0, Time elapsed: 2.399 sec, Thread:
2, Class: org.apache.zookeeper.test.WatcherFuncTest
    [junit] Running org.apache.zookeeper.test.WatcherTest in thread 2
    [junit] Tests run: 4, Failures: 0, Errors: 0, Skipped: 0, Time elapsed: 19.753 sec, Thread:
3, Class: org.apache.zookeeper.test.WatchEventWhenAutoResetTest
    [junit] Running org.apache.zookeeper.test.X509AuthTest in thread 3
    [junit] Tests run: 3, Failures: 0, Errors: 0, Skipped: 0, Time elapsed: 0.095 sec, Thread:
3, Class: org.apache.zookeeper.test.X509AuthTest
    [junit] Running org.apache.zookeeper.test.ZkDatabaseCorruptionTest in thread 3
    [junit] Tests run: 2, Failures: 0, Errors: 0, Skipped: 0, Time elapsed: 13.106 sec, Thread:
3, Class: org.apache.zookeeper.test.ZkDatabaseCorruptionTest
    [junit] Running org.apache.zookeeper.test.ZooKeeperQuotaTest in thread 3
    [junit] Tests run: 1, Failures: 0, Errors: 0, Skipped: 0, Time elapsed: 0.871 sec, Thread:
3, Class: org.apache.zookeeper.test.ZooKeeperQuotaTest
    [junit] Running org.apache.zookeeper.util.PemReaderTest in thread 3
    [junit] Tests run: 8, Failures: 0, Errors: 0, Skipped: 0, Time elapsed: 30.275 sec, Thread:
2, Class: org.apache.zookeeper.test.WatcherTest
    [junit] Tests run: 64, Failures: 0, Errors: 0, Skipped: 0, Time elapsed: 3.044 sec, Thread:
3, Class: org.apache.zookeeper.util.PemReaderTest
    [junit] Running org.apache.jute.BinaryInputArchiveTest in thread 2
    [junit] Running org.apache.jute.UtilsTest in thread 3
    [junit] Tests run: 7, Failures: 0, Errors: 0, Skipped: 0, Time elapsed: 0.158 sec, Thread:
2, Class: org.apache.jute.BinaryInputArchiveTest
    [junit] Tests run: 5, Failures: 0, Errors: 0, Skipped: 0, Time elapsed: 0.084 sec, Thread:
3, Class: org.apache.jute.UtilsTest
    [junit] Running org.apache.jute.XmlInputArchiveTest in thread 2
    [junit] Tests run: 6, Failures: 0, Errors: 0, Skipped: 0, Time elapsed: 0.17 sec, Thread:
2, Class: org.apache.jute.XmlInputArchiveTest
    [junit] Tests run: 106, Failures: 0, Errors: 0, Skipped: 0, Time elapsed: 354.323 sec,
Thread: 1, Class: org.apache.zookeeper.test.NioNettySuiteTest
    [junit] Tests run: 13, Failures: 0, Errors: 0, Skipped: 0, Time elapsed: 260.714 sec,
Thread: 4, Class: org.apache.zookeeper.test.ReconfigTest

fail.build.on.test.failure:

BUILD FAILED
/home/jenkins/jenkins-slave/workspace/ZooKeeper-trunk/build.xml:1473: The following error
occurred while executing this line:
/home/jenkins/jenkins-slave/workspace/ZooKeeper-trunk/build.xml:1326: The following error
occurred while executing this line:
/home/jenkins/jenkins-slave/workspace/ZooKeeper-trunk/build.xml:1330: Tests failed!

Total time: 18 minutes 38 seconds
Build step 'Execute shell' marked build as failure
[FINDBUGS] Skipping publisher since build result is FAILURE
[WARNINGS] Skipping publisher since build result is FAILURE
Archiving artifacts
[JIRA] Updating issue ZOOKEEPER-3249
[JIRA] Updating issue ZOOKEEPER-3251
[JIRA] Updating issue ZOOKEEPER-3257
Recording test results
Email was triggered for: Failure - Any
Sending email for trigger: Failure - Any



###################################################################################
############################## FAILED TESTS (if any) ##############################
1 tests failed.
FAILED:  org.apache.zookeeper.common.TimeTest.testElapsedTimeToDate

Error Message:
Address already in use

Stack Trace:
java.net.BindException: Address already in use
	at sun.nio.ch.Net.bind0(Native Method)
	at sun.nio.ch.Net.bind(Net.java:433)
	at sun.nio.ch.Net.bind(Net.java:425)
	at sun.nio.ch.ServerSocketChannelImpl.bind(ServerSocketChannelImpl.java:223)
	at sun.nio.ch.ServerSocketAdaptor.bind(ServerSocketAdaptor.java:74)
	at sun.nio.ch.ServerSocketAdaptor.bind(ServerSocketAdaptor.java:67)
	at org.apache.zookeeper.server.NIOServerCnxnFactory.configure(NIOServerCnxnFactory.java:685)
	at org.apache.zookeeper.server.ServerCnxnFactory.configure(ServerCnxnFactory.java:102)
	at org.apache.zookeeper.server.ServerCnxnFactory.createFactory(ServerCnxnFactory.java:181)
	at org.apache.zookeeper.server.ServerCnxnFactory.createFactory(ServerCnxnFactory.java:174)
	at org.apache.zookeeper.test.ClientBase.createNewServerInstance(ClientBase.java:452)
	at org.apache.zookeeper.test.ClientBase.startServer(ClientBase.java:539)
	at org.apache.zookeeper.test.ClientBase.setUpWithServerId(ClientBase.java:528)
	at org.apache.zookeeper.test.ClientBase.setUp(ClientBase.java:504)
Mime
  • Unnamed multipart/mixed (inline, None, 0 bytes)
View raw message