zookeeper-dev mailing list archives

Site index · List index
Message view « Date » · « Thread »
Top « Date » · « Thread »
From Apache Jenkins Server <jenk...@builds.apache.org>
Subject ZooKeeper-trunk - Build # 296 - Failure
Date Thu, 06 Dec 2018 12:44:27 GMT
See https://builds.apache.org/job/ZooKeeper-trunk/296/

###################################################################################
########################## LAST 60 LINES OF THE CONSOLE ###########################
[...truncated 177.58 KB...]
    [junit] Running org.apache.zookeeper.test.SessionTest in thread 1
    [junit] Tests run: 6, Failures: 0, Errors: 0, Skipped: 0, Time elapsed: 16.361 sec, Thread:
1, Class: org.apache.zookeeper.test.SessionTest
    [junit] Running org.apache.zookeeper.test.SessionTimeoutTest in thread 1
    [junit] Tests run: 4, Failures: 0, Errors: 0, Skipped: 0, Time elapsed: 1.379 sec, Thread:
1, Class: org.apache.zookeeper.test.SessionTimeoutTest
    [junit] Running org.apache.zookeeper.test.SessionTrackerCheckTest in thread 1
    [junit] Tests run: 2, Failures: 0, Errors: 0, Skipped: 0, Time elapsed: 0.089 sec, Thread:
1, Class: org.apache.zookeeper.test.SessionTrackerCheckTest
    [junit] Running org.apache.zookeeper.test.SessionUpgradeTest in thread 1
    [junit] Tests run: 106, Failures: 0, Errors: 2, Skipped: 0, Time elapsed: 334.325 sec,
Thread: 3, Class: org.apache.zookeeper.test.NettyNettySuiteTest
    [junit] Test org.apache.zookeeper.test.NettyNettySuiteTest FAILED
    [junit] Running org.apache.zookeeper.test.StandaloneTest in thread 3
    [junit] Tests run: 4, Failures: 0, Errors: 0, Skipped: 0, Time elapsed: 2.631 sec, Thread:
3, Class: org.apache.zookeeper.test.StandaloneTest
    [junit] Running org.apache.zookeeper.test.StatTest in thread 3
    [junit] Tests run: 4, Failures: 0, Errors: 0, Skipped: 0, Time elapsed: 1.044 sec, Thread:
3, Class: org.apache.zookeeper.test.StatTest
    [junit] Running org.apache.zookeeper.test.StaticHostProviderTest in thread 3
    [junit] Tests run: 26, Failures: 0, Errors: 0, Skipped: 0, Time elapsed: 1.743 sec, Thread:
3, Class: org.apache.zookeeper.test.StaticHostProviderTest
    [junit] Running org.apache.zookeeper.test.StringUtilTest in thread 3
    [junit] Tests run: 1, Failures: 0, Errors: 0, Skipped: 0, Time elapsed: 0.074 sec, Thread:
3, Class: org.apache.zookeeper.test.StringUtilTest
    [junit] Running org.apache.zookeeper.test.SyncCallTest in thread 3
    [junit] Tests run: 1, Failures: 0, Errors: 0, Skipped: 0, Time elapsed: 0.917 sec, Thread:
3, Class: org.apache.zookeeper.test.SyncCallTest
    [junit] Tests run: 4, Failures: 0, Errors: 0, Skipped: 0, Time elapsed: 19.719 sec, Thread:
1, Class: org.apache.zookeeper.test.SessionUpgradeTest
    [junit] Running org.apache.zookeeper.test.TruncateTest in thread 3
    [junit] Running org.apache.zookeeper.test.WatchEventWhenAutoResetTest in thread 1
    [junit] Tests run: 3, Failures: 0, Errors: 0, Skipped: 0, Time elapsed: 4.933 sec, Thread:
3, Class: org.apache.zookeeper.test.TruncateTest
    [junit] Running org.apache.zookeeper.test.WatchedEventTest in thread 3
    [junit] Tests run: 4, Failures: 0, Errors: 0, Skipped: 0, Time elapsed: 0.09 sec, Thread:
3, Class: org.apache.zookeeper.test.WatchedEventTest
    [junit] Running org.apache.zookeeper.test.WatcherFuncTest in thread 3
    [junit] Tests run: 6, Failures: 0, Errors: 0, Skipped: 0, Time elapsed: 2.045 sec, Thread:
3, Class: org.apache.zookeeper.test.WatcherFuncTest
    [junit] Running org.apache.zookeeper.test.WatcherTest in thread 3
    [junit] Tests run: 4, Failures: 0, Errors: 0, Skipped: 0, Time elapsed: 20.569 sec, Thread:
1, Class: org.apache.zookeeper.test.WatchEventWhenAutoResetTest
    [junit] Running org.apache.zookeeper.test.X509AuthTest in thread 1
    [junit] Tests run: 3, Failures: 0, Errors: 0, Skipped: 0, Time elapsed: 0.093 sec, Thread:
1, Class: org.apache.zookeeper.test.X509AuthTest
    [junit] Running org.apache.zookeeper.test.ZkDatabaseCorruptionTest in thread 1
    [junit] Tests run: 2, Failures: 0, Errors: 0, Skipped: 0, Time elapsed: 5.838 sec, Thread:
1, Class: org.apache.zookeeper.test.ZkDatabaseCorruptionTest
    [junit] Running org.apache.zookeeper.test.ZooKeeperQuotaTest in thread 1
    [junit] Tests run: 1, Failures: 0, Errors: 0, Skipped: 0, Time elapsed: 0.728 sec, Thread:
1, Class: org.apache.zookeeper.test.ZooKeeperQuotaTest
    [junit] Running org.apache.zookeeper.util.PemReaderTest in thread 1
    [junit] Tests run: 64, Failures: 0, Errors: 0, Skipped: 0, Time elapsed: 3.077 sec, Thread:
1, Class: org.apache.zookeeper.util.PemReaderTest
    [junit] Running org.apache.jute.BinaryInputArchiveTest in thread 1
    [junit] Tests run: 1, Failures: 0, Errors: 0, Skipped: 0, Time elapsed: 0.074 sec, Thread:
1, Class: org.apache.jute.BinaryInputArchiveTest
    [junit] Tests run: 8, Failures: 0, Errors: 0, Skipped: 0, Time elapsed: 29.808 sec, Thread:
3, Class: org.apache.zookeeper.test.WatcherTest
    [junit] Tests run: 106, Failures: 0, Errors: 0, Skipped: 0, Time elapsed: 352.607 sec,
Thread: 4, Class: org.apache.zookeeper.test.NioNettySuiteTest
    [junit] Tests run: 13, Failures: 0, Errors: 0, Skipped: 0, Time elapsed: 262.526 sec,
Thread: 2, Class: org.apache.zookeeper.test.ReconfigTest

fail.build.on.test.failure:

BUILD FAILED
/home/jenkins/jenkins-slave/workspace/ZooKeeper-trunk/build.xml:1472: The following error
occurred while executing this line:
/home/jenkins/jenkins-slave/workspace/ZooKeeper-trunk/build.xml:1325: The following error
occurred while executing this line:
/home/jenkins/jenkins-slave/workspace/ZooKeeper-trunk/build.xml:1329: Tests failed!

Total time: 18 minutes 32 seconds
Build step 'Execute shell' marked build as failure
[FINDBUGS] Skipping publisher since build result is FAILURE
[WARNINGS] Skipping publisher since build result is FAILURE
Archiving artifacts
[JIRA] Updating issue ZOOKEEPER-1818
Recording test results
Email was triggered for: Failure - Any
Sending email for trigger: Failure - Any



###################################################################################
############################## FAILED TESTS (if any) ##############################
2 tests failed.
FAILED:  org.apache.zookeeper.server.ZxidRolloverTest.testRolloverThenRestart

Error Message:
Failed to connect to ZooKeeper server.

Stack Trace:
java.util.concurrent.TimeoutException: Failed to connect to ZooKeeper server.
	at org.apache.zookeeper.test.ClientBase$CountdownWatcher.waitForConnected(ClientBase.java:151)
	at org.apache.zookeeper.server.ZxidRolloverTest.waitForClientsConnected(ZxidRolloverTest.java:80)
	at org.apache.zookeeper.server.ZxidRolloverTest.setUp(ZxidRolloverTest.java:75)


FAILED:  org.apache.zookeeper.test.AsyncOpsTest.testAsyncCreateFailure_NoNode

Error Message:
unable to create new native thread

Stack Trace:
java.lang.OutOfMemoryError: unable to create new native thread
	at java.lang.Thread.start0(Native Method)
	at java.lang.Thread.start(Thread.java:717)
	at com.sun.jmx.remote.internal.ClientCommunicatorAdmin.<init>(ClientCommunicatorAdmin.java:45)
	at javax.management.remote.rmi.RMIConnector$RMIClientCommunicatorAdmin.<init>(RMIConnector.java:1493)
	at javax.management.remote.rmi.RMIConnector.connect(RMIConnector.java:339)
	at javax.management.remote.JMXConnectorFactory.connect(JMXConnectorFactory.java:270)
	at javax.management.remote.JMXConnectorFactory.connect(JMXConnectorFactory.java:229)
	at org.apache.zookeeper.test.JMXEnv.setUp(JMXEnv.java:58)
	at org.apache.zookeeper.test.ClientBase.setUpWithServerId(ClientBase.java:522)
	at org.apache.zookeeper.test.ClientBase.setUp(ClientBase.java:504)
	at org.apache.zookeeper.test.AsyncOpsTest.setUp(AsyncOpsTest.java:48)
Mime
  • Unnamed multipart/mixed (inline, None, 0 bytes)
View raw message