zookeeper-dev mailing list archives

Site index · List index
Message view « Date » · « Thread »
Top « Date » · « Thread »
From Apache Jenkins Server <jenk...@builds.apache.org>
Subject ZooKeeper_branch35_jdk8 - Build # 1246 - Failure
Date Mon, 31 Dec 2018 15:48:31 GMT
See https://builds.apache.org/job/ZooKeeper_branch35_jdk8/1246/

###################################################################################
########################## LAST 60 LINES OF THE CONSOLE ###########################
[...truncated 106.71 KB...]
    [junit] Running org.apache.zookeeper.test.SaslSuperUserTest in thread 1
    [junit] Running org.apache.zookeeper.test.ServerCnxnTest in thread 2
    [junit] Tests run: 1, Failures: 0, Errors: 0, Skipped: 0, Time elapsed: 5.304 sec, Thread:
1, Class: org.apache.zookeeper.test.SaslSuperUserTest
    [junit] Tests run: 1, Failures: 0, Errors: 0, Skipped: 0, Time elapsed: 6.15 sec, Thread:
2, Class: org.apache.zookeeper.test.ServerCnxnTest
    [junit] Running org.apache.zookeeper.test.SessionInvalidationTest in thread 1
    [junit] Running org.apache.zookeeper.test.SessionTest in thread 2
    [junit] Tests run: 1, Failures: 0, Errors: 0, Skipped: 0, Time elapsed: 4.405 sec, Thread:
1, Class: org.apache.zookeeper.test.SessionInvalidationTest
    [junit] Running org.apache.zookeeper.test.SessionTimeoutTest in thread 1
    [junit] Tests run: 4, Failures: 0, Errors: 0, Skipped: 0, Time elapsed: 4.313 sec, Thread:
1, Class: org.apache.zookeeper.test.SessionTimeoutTest
    [junit] Running org.apache.zookeeper.test.SessionTrackerCheckTest in thread 1
    [junit] Tests run: 2, Failures: 0, Errors: 0, Skipped: 0, Time elapsed: 0.53 sec, Thread:
1, Class: org.apache.zookeeper.test.SessionTrackerCheckTest
    [junit] Tests run: 5, Failures: 0, Errors: 0, Skipped: 0, Time elapsed: 17.062 sec, Thread:
2, Class: org.apache.zookeeper.test.SessionTest
    [junit] Running org.apache.zookeeper.test.SessionUpgradeTest in thread 1
    [junit] Running org.apache.zookeeper.test.StandaloneTest in thread 2
    [junit] Tests run: 4, Failures: 0, Errors: 0, Skipped: 0, Time elapsed: 6.419 sec, Thread:
2, Class: org.apache.zookeeper.test.StandaloneTest
    [junit] Running org.apache.zookeeper.test.StatTest in thread 2
    [junit] Tests run: 4, Failures: 0, Errors: 0, Skipped: 0, Time elapsed: 7.474 sec, Thread:
2, Class: org.apache.zookeeper.test.StatTest
    [junit] Running org.apache.zookeeper.test.StaticHostProviderTest in thread 2
    [junit] Tests run: 1, Failures: 0, Errors: 0, Skipped: 0, Time elapsed: 159.251 sec, Thread:
4, Class: org.apache.zookeeper.test.RecoveryTest
    [junit] Running org.apache.zookeeper.test.StringUtilTest in thread 4
    [junit] Tests run: 1, Failures: 0, Errors: 0, Skipped: 0, Time elapsed: 0.787 sec, Thread:
4, Class: org.apache.zookeeper.test.StringUtilTest
    [junit] Tests run: 26, Failures: 0, Errors: 0, Skipped: 0, Time elapsed: 8.691 sec, Thread:
2, Class: org.apache.zookeeper.test.StaticHostProviderTest
    [junit] Running org.apache.zookeeper.test.SyncCallTest in thread 4
    [junit] Running org.apache.zookeeper.test.TruncateTest in thread 2
    [junit] Tests run: 4, Failures: 0, Errors: 0, Skipped: 0, Time elapsed: 48.136 sec, Thread:
1, Class: org.apache.zookeeper.test.SessionUpgradeTest
    [junit] Tests run: 1, Failures: 0, Errors: 0, Skipped: 0, Time elapsed: 7.18 sec, Thread:
4, Class: org.apache.zookeeper.test.SyncCallTest
    [junit] Running org.apache.zookeeper.test.WatchEventWhenAutoResetTest in thread 1
    [junit] Running org.apache.zookeeper.test.WatchedEventTest in thread 4
    [junit] Tests run: 4, Failures: 0, Errors: 0, Skipped: 0, Time elapsed: 0.801 sec, Thread:
4, Class: org.apache.zookeeper.test.WatchedEventTest
    [junit] Tests run: 3, Failures: 0, Errors: 0, Skipped: 0, Time elapsed: 16.428 sec, Thread:
2, Class: org.apache.zookeeper.test.TruncateTest
    [junit] Running org.apache.zookeeper.test.WatcherFuncTest in thread 4
    [junit] Running org.apache.zookeeper.test.WatcherTest in thread 2
    [junit] Tests run: 6, Failures: 0, Errors: 0, Skipped: 0, Time elapsed: 12.06 sec, Thread:
4, Class: org.apache.zookeeper.test.WatcherFuncTest
    [junit] Running org.apache.zookeeper.test.X509AuthTest in thread 4
    [junit] Tests run: 3, Failures: 0, Errors: 0, Skipped: 0, Time elapsed: 1.238 sec, Thread:
4, Class: org.apache.zookeeper.test.X509AuthTest
    [junit] Running org.apache.zookeeper.test.ZkDatabaseCorruptionTest in thread 4
    [junit] Tests run: 4, Failures: 0, Errors: 0, Skipped: 0, Time elapsed: 44.348 sec, Thread:
1, Class: org.apache.zookeeper.test.WatchEventWhenAutoResetTest
    [junit] Running org.apache.zookeeper.test.ZooKeeperQuotaTest in thread 1
    [junit] Tests run: 8, Failures: 0, Errors: 0, Skipped: 0, Time elapsed: 46.243 sec, Thread:
2, Class: org.apache.zookeeper.test.WatcherTest
    [junit] Tests run: 1, Failures: 0, Errors: 0, Skipped: 0, Time elapsed: 10.223 sec, Thread:
1, Class: org.apache.zookeeper.test.ZooKeeperQuotaTest
    [junit] Tests run: 2, Failures: 0, Errors: 0, Skipped: 0, Time elapsed: 33.367 sec, Thread:
4, Class: org.apache.zookeeper.test.ZkDatabaseCorruptionTest
    [junit] Running org.apache.zookeeper.util.PemReaderTest in thread 2
    [junit] Running org.apache.jute.BinaryInputArchiveTest in thread 1
    [junit] Tests run: 1, Failures: 0, Errors: 0, Skipped: 0, Time elapsed: 0.596 sec, Thread:
1, Class: org.apache.jute.BinaryInputArchiveTest
    [junit] Tests run: 64, Failures: 0, Errors: 0, Skipped: 0, Time elapsed: 16.328 sec, Thread:
2, Class: org.apache.zookeeper.util.PemReaderTest
    [junit] Tests run: 13, Failures: 0, Errors: 0, Skipped: 0, Time elapsed: 333.088 sec,
Thread: 3, Class: org.apache.zookeeper.test.ReconfigTest

fail.build.on.test.failure:

BUILD FAILED
/home/jenkins/jenkins-slave/workspace/ZooKeeper_branch35_jdk8/build.xml:1318: The following
error occurred while executing this line:
/home/jenkins/jenkins-slave/workspace/ZooKeeper_branch35_jdk8/build.xml:1322: Tests failed!

Total time: 43 minutes 28 seconds
Build step 'Invoke Ant' marked build as failure
Archiving artifacts
Recording test results
Email was triggered for: Failure - Any
Sending email for trigger: Failure - Any



###################################################################################
############################## FAILED TESTS (if any) ##############################
1 tests failed.
FAILED:  org.apache.zookeeper.server.quorum.QuorumSSLTest.testRollingUpgrade

Error Message:
null

Stack Trace:
junit.framework.AssertionFailedError
	at org.apache.zookeeper.server.quorum.QuorumSSLTest.stopAppendConfigRestartAll(QuorumSSLTest.java:490)
	at org.apache.zookeeper.server.quorum.QuorumSSLTest.testRollingUpgrade(QuorumSSLTest.java:472)
	at org.apache.zookeeper.JUnit4ZKTestRunner$LoggedInvokeMethod.evaluate(JUnit4ZKTestRunner.java:79)
	at java.util.concurrent.FutureTask.run(FutureTask.java:266)
	at java.lang.Thread.run(Thread.java:748)
Mime
  • Unnamed multipart/mixed (inline, None, 0 bytes)
View raw message