zookeeper-dev mailing list archives

Site index · List index
Message view « Date » · « Thread »
Top « Date » · « Thread »
From Apache Jenkins Server <jenk...@builds.apache.org>
Subject ZooKeeper-trunk - Build # 313 - Failure
Date Tue, 18 Dec 2018 01:17:28 GMT
See https://builds.apache.org/job/ZooKeeper-trunk/313/

###################################################################################
########################## LAST 60 LINES OF THE CONSOLE ###########################
[...truncated 313.12 KB...]
     [exec]  : elapsed 1001 : OK
     [exec] Zookeeper_simpleSystem::testLogCallbackClearLog Message Received: [2018-12-18
01:14:02,415:14745(0x2af96339cf40):ZOO_INFO@log_env@1080: Client environment:zookeeper.version=zookeeper
C client 3.6.0]
     [exec] Log Message Received: [2018-12-18 01:14:02,415:14745(0x2af96339cf40):ZOO_INFO@log_env@1084:
Client environment:host.name=asf905.gq1.ygridcore.net]
     [exec] Log Message Received: [2018-12-18 01:14:02,415:14745(0x2af96339cf40):ZOO_INFO@log_env@1091:
Client environment:os.name=Linux]
     [exec] Log Message Received: [2018-12-18 01:14:02,415:14745(0x2af96339cf40):ZOO_INFO@log_env@1092:
Client environment:os.arch=4.4.0-138-generic]
     [exec] Log Message Received: [2018-12-18 01:14:02,415:14745(0x2af96339cf40):ZOO_INFO@log_env@1093:
Client environment:os.version=#164~14.04.1-Ubuntu SMP Fri Oct 5 08:56:16 UTC 2018]
     [exec] Log Message Received: [2018-12-18 01:14:02,415:14745(0x2af96339cf40):ZOO_INFO@log_env@1101:
Client environment:user.name=jenkins]
     [exec] Log Message Received: [2018-12-18 01:14:02,415:14745(0x2af96339cf40):ZOO_INFO@log_env@1109:
Client environment:user.home=/home/jenkins]
     [exec] Log Message Received: [2018-12-18 01:14:02,415:14745(0x2af96339cf40):ZOO_INFO@log_env@1121:
Client environment:user.dir=/home/jenkins/jenkins-slave/workspace/ZooKeeper-trunk/build/test/test-cppunit]
     [exec] Log Message Received: [2018-12-18 01:14:02,415:14745(0x2af96339cf40):ZOO_INFO@zookeeper_init_internal@1167:
Initiating client connection, host=127.0.0.1:22181 sessionTimeout=10000 watcher=0x464840 sessionId=0
sessionPasswd=<null> context=0x7ffe80237520 flags=0]
     [exec] Log Message Received: [2018-12-18 01:14:02,415:14745(0x2af965600700):ZOO_INFO@check_events@2454:
initiated connection to server 127.0.0.1:22181]
     [exec] Log Message Received: [2018-12-18 01:14:02,431:14745(0x2af965600700):ZOO_INFO@check_events@2506:
session establishment complete on server 127.0.0.1:22181, sessionId=0x100675773ec0010, negotiated
timeout=10000 ]
     [exec]  : elapsed 1001 : OK
     [exec] Zookeeper_simpleSystem::testAsyncWatcherAutoReset ZooKeeper server started : elapsed
10522 : OK
     [exec] Zookeeper_simpleSystem::testDeserializeString : elapsed 0 : OK
     [exec] Zookeeper_simpleSystem::testFirstServerDown : elapsed 1001 : OK
     [exec] Zookeeper_simpleSystem::testNonexistentHost : elapsed 1035 : OK
     [exec] Zookeeper_simpleSystem::testNullData : elapsed 1050 : OK
     [exec] Zookeeper_simpleSystem::testIPV6 : elapsed 1016 : OK
     [exec] Zookeeper_simpleSystem::testCreate : elapsed 1024 : OK
     [exec] Zookeeper_simpleSystem::testPath : elapsed 1050 : OK
     [exec] Zookeeper_simpleSystem::testPathValidation : elapsed 1158 : OK
     [exec] Zookeeper_simpleSystem::testPing : elapsed 17686 : OK
     [exec] Zookeeper_simpleSystem::testAcl : elapsed 1023 : OK
     [exec] Zookeeper_simpleSystem::testChroot : elapsed 3140 : OK
     [exec] Zookeeper_simpleSystem::testAuth ZooKeeper server started ZooKeeper server started
: elapsed 31237 : OK
     [exec] Zookeeper_simpleSystem::testHangingClient : elapsed 1105 : OK
     [exec] Zookeeper_simpleSystem::testWatcherAutoResetWithGlobal ZooKeeper server started
ZooKeeper server started ZooKeeper server started : elapsed 15652 : OK
     [exec] Zookeeper_simpleSystem::testWatcherAutoResetWithLocal ZooKeeper server started
ZooKeeper server started ZooKeeper server started : elapsed 15737 : OK
     [exec] Zookeeper_simpleSystem::testGetChildren2 : elapsed 1060 : OK
     [exec] Zookeeper_simpleSystem::testLastZxid : elapsed 4530 : OK
     [exec] Zookeeper_simpleSystem::testRemoveWatchers ZooKeeper server started : elapsed
4627 : OK
     [exec] Zookeeper_readOnly::testReadOnly : elapsed 4179 : OK
     [exec] *** Error in `./zktest-mt': free(): invalid pointer: 0x00002af963388000 ***Zookeeper_logClientEnv::testLogClientEnv
: elapsed 1 : OK
     [exec] 
     [exec] OK (77)
     [exec] FAIL: zktest-mt
     [exec] ==========================================
     [exec] 1 of 2 tests failed
     [exec] Please report to user@zookeeper.apache.org
     [exec] ==========================================
     [exec] make[1]: Leaving directory `/home/jenkins/jenkins-slave/workspace/ZooKeeper-trunk/build/test/test-cppunit'
     [exec] /bin/bash: line 5: 14745 Aborted                 ZKROOT=/home/jenkins/jenkins-slave/workspace/ZooKeeper-trunk/zookeeper-client/zookeeper-client-c/../..
CLASSPATH=$CLASSPATH:$CLOVER_HOME/lib/clover.jar ${dir}$tst
     [exec] make[1]: *** [check-TESTS] Error 1
     [exec] make: *** [check-am] Error 2

BUILD FAILED
/home/jenkins/jenkins-slave/workspace/ZooKeeper-trunk/build.xml:1472: The following error
occurred while executing this line:
/home/jenkins/jenkins-slave/workspace/ZooKeeper-trunk/build.xml:1432: The following error
occurred while executing this line:
/home/jenkins/jenkins-slave/workspace/ZooKeeper-trunk/build.xml:1442: exec returned: 2

Total time: 29 minutes 22 seconds
Build step 'Execute shell' marked build as failure
[FINDBUGS] Skipping publisher since build result is FAILURE
[WARNINGS] Skipping publisher since build result is FAILURE
Archiving artifacts
Recording test results
Email was triggered for: Failure - Any
Sending email for trigger: Failure - Any



###################################################################################
############################## FAILED TESTS (if any) ##############################
All tests passed
Mime
  • Unnamed multipart/mixed (inline, None, 0 bytes)
View raw message