zookeeper-dev mailing list archives

Site index · List index
Message view « Date » · « Thread »
Top « Date » · « Thread »
From Apache Jenkins Server <jenk...@builds.apache.org>
Subject ZooKeeper_branch35_jdk8 - Build # 1177 - Still Failing
Date Fri, 02 Nov 2018 12:25:44 GMT
See https://builds.apache.org/job/ZooKeeper_branch35_jdk8/1177/

###################################################################################
########################## LAST 60 LINES OF THE CONSOLE ###########################
[...truncated 108.46 KB...]
    [junit] Running org.apache.zookeeper.test.SaslClientTest in thread 3
    [junit] Tests run: 1, Failures: 0, Errors: 0, Skipped: 0, Time elapsed: 0.647 sec, Thread:
3, Class: org.apache.zookeeper.test.SaslClientTest
    [junit] Tests run: 1, Failures: 0, Errors: 0, Skipped: 0, Time elapsed: 4.51 sec, Thread:
4, Class: org.apache.zookeeper.test.SaslAuthMissingClientConfigTest
    [junit] Running org.apache.zookeeper.test.SaslSuperUserTest in thread 1
    [junit] Running org.apache.zookeeper.test.ServerCnxnTest in thread 3
    [junit] Running org.apache.zookeeper.test.SessionInvalidationTest in thread 4
    [junit] Tests run: 1, Failures: 0, Errors: 0, Skipped: 0, Time elapsed: 4.62 sec, Thread:
1, Class: org.apache.zookeeper.test.SaslSuperUserTest
    [junit] Tests run: 1, Failures: 0, Errors: 0, Skipped: 0, Time elapsed: 5.57 sec, Thread:
3, Class: org.apache.zookeeper.test.ServerCnxnTest
    [junit] Tests run: 1, Failures: 0, Errors: 0, Skipped: 0, Time elapsed: 3.77 sec, Thread:
4, Class: org.apache.zookeeper.test.SessionInvalidationTest
    [junit] Running org.apache.zookeeper.test.SessionTest in thread 1
    [junit] Running org.apache.zookeeper.test.SessionTimeoutTest in thread 3
    [junit] Running org.apache.zookeeper.test.SessionTrackerCheckTest in thread 4
    [junit] Tests run: 2, Failures: 0, Errors: 0, Skipped: 0, Time elapsed: 0.676 sec, Thread:
4, Class: org.apache.zookeeper.test.SessionTrackerCheckTest
    [junit] Running org.apache.zookeeper.test.SessionUpgradeTest in thread 4
    [junit] Tests run: 4, Failures: 0, Errors: 0, Skipped: 0, Time elapsed: 6.664 sec, Thread:
3, Class: org.apache.zookeeper.test.SessionTimeoutTest
    [junit] Running org.apache.zookeeper.test.StandaloneTest in thread 3
    [junit] Tests run: 5, Failures: 0, Errors: 0, Skipped: 0, Time elapsed: 16.899 sec, Thread:
1, Class: org.apache.zookeeper.test.SessionTest
    [junit] Tests run: 4, Failures: 0, Errors: 0, Skipped: 0, Time elapsed: 4.861 sec, Thread:
3, Class: org.apache.zookeeper.test.StandaloneTest
    [junit] Running org.apache.zookeeper.test.StatTest in thread 1
    [junit] Running org.apache.zookeeper.test.StaticHostProviderTest in thread 3
    [junit] Tests run: 4, Failures: 0, Errors: 0, Skipped: 0, Time elapsed: 6.889 sec, Thread:
1, Class: org.apache.zookeeper.test.StatTest
    [junit] Tests run: 26, Failures: 0, Errors: 0, Skipped: 0, Time elapsed: 6.656 sec, Thread:
3, Class: org.apache.zookeeper.test.StaticHostProviderTest
    [junit] Running org.apache.zookeeper.test.StringUtilTest in thread 1
    [junit] Tests run: 1, Failures: 0, Errors: 0, Skipped: 0, Time elapsed: 0.43 sec, Thread:
1, Class: org.apache.zookeeper.test.StringUtilTest
    [junit] Running org.apache.zookeeper.test.SyncCallTest in thread 3
    [junit] Running org.apache.zookeeper.test.TruncateTest in thread 1
    [junit] Tests run: 4, Failures: 0, Errors: 0, Skipped: 0, Time elapsed: 31.981 sec, Thread:
4, Class: org.apache.zookeeper.test.SessionUpgradeTest
    [junit] Tests run: 1, Failures: 0, Errors: 0, Skipped: 0, Time elapsed: 4.576 sec, Thread:
3, Class: org.apache.zookeeper.test.SyncCallTest
    [junit] Running org.apache.zookeeper.test.WatchedEventTest in thread 4
    [junit] Running org.apache.zookeeper.test.WatchEventWhenAutoResetTest in thread 3
    [junit] Tests run: 4, Failures: 0, Errors: 0, Skipped: 0, Time elapsed: 0.474 sec, Thread:
4, Class: org.apache.zookeeper.test.WatchedEventTest
    [junit] Tests run: 3, Failures: 0, Errors: 0, Skipped: 0, Time elapsed: 10.526 sec, Thread:
1, Class: org.apache.zookeeper.test.TruncateTest
    [junit] Running org.apache.zookeeper.test.WatcherFuncTest in thread 4
    [junit] Running org.apache.zookeeper.test.WatcherTest in thread 1
    [junit] Tests run: 6, Failures: 0, Errors: 0, Skipped: 0, Time elapsed: 9.888 sec, Thread:
4, Class: org.apache.zookeeper.test.WatcherFuncTest
    [junit] Running org.apache.zookeeper.test.X509AuthTest in thread 4
    [junit] Tests run: 3, Failures: 0, Errors: 0, Skipped: 0, Time elapsed: 0.541 sec, Thread:
4, Class: org.apache.zookeeper.test.X509AuthTest
    [junit] Running org.apache.zookeeper.test.ZkDatabaseCorruptionTest in thread 4
    [junit] Tests run: 4, Failures: 0, Errors: 0, Skipped: 0, Time elapsed: 34.464 sec, Thread:
3, Class: org.apache.zookeeper.test.WatchEventWhenAutoResetTest
    [junit] Running org.apache.zookeeper.test.ZooKeeperQuotaTest in thread 3
    [junit] Tests run: 1, Failures: 0, Errors: 0, Skipped: 0, Time elapsed: 6.352 sec, Thread:
3, Class: org.apache.zookeeper.test.ZooKeeperQuotaTest
    [junit] Tests run: 8, Failures: 0, Errors: 0, Skipped: 0, Time elapsed: 40.834 sec, Thread:
1, Class: org.apache.zookeeper.test.WatcherTest
    [junit] Running org.apache.jute.BinaryInputArchiveTest in thread 3
    [junit] Tests run: 1, Failures: 0, Errors: 0, Skipped: 0, Time elapsed: 0.449 sec, Thread:
3, Class: org.apache.jute.BinaryInputArchiveTest
    [junit] Tests run: 2, Failures: 0, Errors: 0, Skipped: 0, Time elapsed: 29.412 sec, Thread:
4, Class: org.apache.zookeeper.test.ZkDatabaseCorruptionTest
    [junit] Tests run: 13, Failures: 0, Errors: 0, Skipped: 0, Time elapsed: 316.97 sec, Thread:
2, Class: org.apache.zookeeper.test.ReconfigTest

fail.build.on.test.failure:

BUILD FAILED
/home/jenkins/jenkins-slave/workspace/ZooKeeper_branch35_jdk8/build.xml:1336: The following
error occurred while executing this line:
/home/jenkins/jenkins-slave/workspace/ZooKeeper_branch35_jdk8/build.xml:1340: Tests failed!

Total time: 33 minutes 24 seconds
Build step 'Invoke Ant' marked build as failure
Archiving artifacts
Recording test results
Email was triggered for: Failure - Any
Sending email for trigger: Failure - Any



###################################################################################
############################## FAILED TESTS (if any) ##############################
2 tests failed.
FAILED:  org.apache.zookeeper.server.quorum.ReconfigBackupTest.testVersionOfDynamicFilename

Error Message:
waiting for server 3 being up

Stack Trace:
junit.framework.AssertionFailedError: waiting for server 3 being up
	at org.apache.zookeeper.server.quorum.ReconfigBackupTest.testVersionOfDynamicFilename(ReconfigBackupTest.java:320)
	at org.apache.zookeeper.JUnit4ZKTestRunner$LoggedInvokeMethod.evaluate(JUnit4ZKTestRunner.java:79)


FAILED:  org.apache.zookeeper.test.FLETest.testSingleElection

Error Message:
Leader hasn't joined: -1

Stack Trace:
junit.framework.AssertionFailedError: Leader hasn't joined: -1
	at org.apache.zookeeper.test.FLETest.runElection(FLETest.java:368)
	at org.apache.zookeeper.test.FLETest.testSingleElection(FLETest.java:267)
	at org.apache.zookeeper.JUnit4ZKTestRunner$LoggedInvokeMethod.evaluate(JUnit4ZKTestRunner.java:79)
Mime
  • Unnamed multipart/mixed (inline, None, 0 bytes)
View raw message