zookeeper-dev mailing list archives

Site index · List index
Message view « Date » · « Thread »
Top « Date » · « Thread »
From Apache Jenkins Server <jenk...@builds.apache.org>
Subject ZooKeeper-trunk - Build # 284 - Failure
Date Tue, 27 Nov 2018 02:17:57 GMT
See https://builds.apache.org/job/ZooKeeper-trunk/284/

###################################################################################
########################## LAST 60 LINES OF THE CONSOLE ###########################
[...truncated 322.20 KB...]
     [exec] 7fb17df0a000-7fb17df0b000 rw-p 0000b000 08:03 10223806                   /lib/x86_64-linux-gnu/libnss_files-2.23.so
     [exec] 7fb17df0b000-7fb17df11000 rw-p 00000000 00:00 0 
     [exec] 7fb17df11000-7fb17e0d1000 r-xp 00000000 08:03 10223790                   /lib/x86_64-linux-gnu/libc-2.23.so
     [exec] 7fb17e0d1000-7fb17e2d1000 ---p 001c0000 08:03 10223790                   /lib/x86_64-linux-gnu/libc-2.23.so
     [exec] 7fb17e2d1000-7fb17e2d5000 r--p 001c0000 08:03 10223790                   /lib/x86_64-linux-gnu/libc-2.23.so
     [exec] 7fb17e2d5000-7fb17e2d7000 rw-p 001c4000 08:03 10223790                   /lib/x86_64-linux-gnu/libc-2.23.so
     [exec] 7fb17e2d7000-7fb17e2db000 rw-p 00000000 00:00 0 
     [exec] 7fb17e2db000-7fb17e2f1000 r-xp 00000000 08:03 10223681                   /lib/x86_64-linux-gnu/libgcc_s.so.1
     [exec] 7fb17e2f1000-7fb17e4f0000 ---p 00016000 08:03 10223681                   /lib/x86_64-linux-gnu/libgcc_s.so.1
     [exec] 7fb17e4f0000-7fb17e4f1000 rw-p 00015000 08:03 10223681                   /lib/x86_64-linux-gnu/libgcc_s.so.1
     [exec] 7fb17e4f1000-7fb17e5f9000 r-xp 00000000 08:03 10223781                   /lib/x86_64-linux-gnu/libm-2.23.so
     [exec] 7fb17e5f9000-7fb17e7f8000 ---p 00108000 08:03 10223781                   /lib/x86_64-linux-gnu/libm-2.23.so
     [exec] 7fb17e7f8000-7fb17e7f9000 r--p 00107000 08:03 10223781                   /lib/x86_64-linux-gnu/libm-2.23.so
     [exec] 7fb17e7f9000-7fb17e7fa000 rw-p 00108000 08:03 10223781                   /lib/x86_64-linux-gnu/libm-2.23.so
     [exec] 7fb17e7fa000-7fb17e96c000 r-xp 00000000 08:03 2622487                    /usr/lib/x86_64-linux-gnu/libstdc++.so.6.0.21
     [exec] 7fb17e96c000-7fb17eb6c000 ---p 00172000 08:03 2622487                    /usr/lib/x86_64-linux-gnu/libstdc++.so.6.0.21
     [exec] 7fb17eb6c000-7fb17eb76000 r--p 00172000 08:03 2622487                    /usr/lib/x86_64-linux-gnu/libstdc++.so.6.0.21
     [exec] 7fb17eb76000-7fb17eb78000 rw-p 0017c000 08:03 2622487                    /usr/lib/x86_64-linux-gnu/libstdc++.so.6.0.21
     [exec] 7fb17eb78000-7fb17eb7c000 rw-p 00000000 00:00 0 
     [exec] 7fb17eb7c000-7fb17eb7f000 r-xp 00000000 08:03 10223792                   /lib/x86_64-linux-gnu/libdl-2.23.so
     [exec] 7fb17eb7f000-7fb17ed7e000 ---p 00003000 08:03 10223792                   /lib/x86_64-linux-gnu/libdl-2.23.so
     [exec] 7fb17ed7e000-7fb17ed7f000 r--p 00002000 08:03 10223792                   /lib/x86_64-linux-gnu/libdl-2.23.so
     [exec] 7fb17ed7f000-7fb17ed80000 rw-p 00003000 08:03 10223792                   /lib/x86_64-linux-gnu/libdl-2.23.so
     [exec] 7fb17ed80000-7fb17edba000 r-xp 00000000 08:03 2640294                    /usr/lib/x86_64-linux-gnu/libcppunit-1.13.so.0.0.2
     [exec] 7fb17edba000-7fb17efba000 ---p 0003a000 08:03 2640294                    /usr/lib/x86_64-linux-gnu/libcppunit-1.13.so.0.0.2
     [exec] 7fb17efba000-7fb17efbc000 r--p 0003a000 08:03 2640294                    /usr/lib/x86_64-linux-gnu/libcppunit-1.13.so.0.0.2
     [exec] 7fb17efbc000-7fb17efbd000 rw-p 0003c000 08:03 2640294                    /usr/lib/x86_64-linux-gnu/libcppunit-1.13.so.0.0.2
     [exec] 7fb17efbd000-7fb17efd5000 r-xp 00000000 08:03 10223788                   /lib/x86_64-linux-gnu/libpthread-2.23.so
     [exec] 7fb17efd5000-7fb17f1d4000 ---p 00018000 08:03 10223788                   /lib/x86_64-linux-gnu/libpthread-2.23.so
     [exec] 7fb17f1d4000-7fb17f1d5000 r--p 00017000 08:03 10223788                   /lib/x86_64-linux-gnu/libpthread-2.23.so
     [exec] 7fb17f1d5000-7fb17f1d6000 rw-p 00018000 08:03 10223788                   /lib/x86_64-linux-gnu/libpthread-2.23.so
     [exec] 7fb17f1d6000-7fb17f1da000 rw-p 00000000 00:00 0 
     [exec] 7fb17f1da000-7fb17f200000 r-xp 00000000 08:03 10223786                   /lib/x86_64-linux-gnu/ld-2.23.so
     [exec] 7fb17f3e6000-7fb17f3ed000 rw-p 00000000 00:00 0 
     [exec] 7fb17f3fe000-7fb17f3ff000 rw-p 00000000 00:00 0 
     [exec] 7fb17f3ff000-7fb17f400000 r--p 00025000 08:03 10223786                   /lib/x86_64-linux-gnu/ld-2.23.so
     [exec] 7fb17f400000-7fb17f401000 rw-p 00026000 08:03 10223786                   /lib/x86_64-linux-gnu/ld-2.23.so
     [exec] 7fb17f401000-7fb17f402000 rw-p 00000000 00:00 0 
     [exec] 7ffc4952c000-7ffc4954d000 rw-p 00000000 00:00 0                          [stack]
     [exec] 7ffc495ac000-7ffc495af000 r--p 00000000 00:00 0                          [vvar]
     [exec] 7ffc495af000-7ffc495b1000 r-xp 00000000 00:00 0                          [vdso]
     [exec] ffffffffff600000-ffffffffff601000 r-xp 00000000 00:00 0                  [vsyscall]
     [exec] /bin/bash: line 5: 31067 Aborted                 ZKROOT=/home/jenkins/jenkins-slave/workspace/ZooKeeper-trunk/zookeeper-client/zookeeper-client-c/../..
CLASSPATH=$CLASSPATH:$CLOVER_HOME/lib/clover.jar ${dir}$tst
     [exec] make[1]: *** [check-TESTS] Error 1
     [exec] make: *** [check-am] Error 2

BUILD FAILED
/home/jenkins/jenkins-slave/workspace/ZooKeeper-trunk/build.xml:1472: The following error
occurred while executing this line:
/home/jenkins/jenkins-slave/workspace/ZooKeeper-trunk/build.xml:1432: The following error
occurred while executing this line:
/home/jenkins/jenkins-slave/workspace/ZooKeeper-trunk/build.xml:1442: exec returned: 2

Total time: 23 minutes 58 seconds
Build step 'Execute shell' marked build as failure
[FINDBUGS] Skipping publisher since build result is FAILURE
[WARNINGS] Skipping publisher since build result is FAILURE
Archiving artifacts
Recording test results
Email was triggered for: Failure - Any
Sending email for trigger: Failure - Any



###################################################################################
############################## FAILED TESTS (if any) ##############################
All tests passed
Mime
  • Unnamed multipart/mixed (inline, None, 0 bytes)
View raw message