zookeeper-dev mailing list archives

Site index · List index
Message view « Date » · « Thread »
Top « Date » · « Thread »
From Apache Jenkins Server <jenk...@builds.apache.org>
Subject Failed: ZOOKEEPER- PreCommit Build #2554
Date Thu, 01 Nov 2018 07:01:16 GMT
Build: https://builds.apache.org/job/PreCommit-ZOOKEEPER-github-pr-build/2554/

###################################################################################
########################## LAST 60 LINES OF THE CONSOLE ###########################
[...truncated 85.51 MB...]
     [exec] ======================================================================
     [exec] 
     [exec] 
     [exec] 
     [exec] Error: No value specified for option "issue"
     [exec] Session logged out.
     [exec] 
     [exec] 
     [exec] ======================================================================
     [exec] ======================================================================
     [exec]     Finished build.
     [exec] ======================================================================
     [exec] ======================================================================
     [exec] 
     [exec] 
     [exec] mv: '/home/jenkins/jenkins-slave/workspace/PreCommit-ZOOKEEPER-github-pr-build/patchprocess'
and '/home/jenkins/jenkins-slave/workspace/PreCommit-ZOOKEEPER-github-pr-build/patchprocess'
are the same file

BUILD FAILED
/home/jenkins/jenkins-slave/workspace/PreCommit-ZOOKEEPER-github-pr-build/build.xml:1859:
exec returned: 1

Total time: 20 minutes 36 seconds
Build step 'Execute shell' marked build as failure
Archiving artifacts
Setting JDK_1_8_LATEST__HOME=/home/jenkins/tools/java/latest1.8
Setting MAVEN_3_LATEST__HOME=/home/jenkins/tools/maven/latest3/
Recording test results
Setting JDK_1_8_LATEST__HOME=/home/jenkins/tools/java/latest1.8
Setting MAVEN_3_LATEST__HOME=/home/jenkins/tools/maven/latest3/
Setting JDK_1_8_LATEST__HOME=/home/jenkins/tools/java/latest1.8
Setting MAVEN_3_LATEST__HOME=/home/jenkins/tools/maven/latest3/
[description-setter] Description set: ZOOKEEPER-706
Setting JDK_1_8_LATEST__HOME=/home/jenkins/tools/java/latest1.8
Setting MAVEN_3_LATEST__HOME=/home/jenkins/tools/maven/latest3/
Setting JDK_1_8_LATEST__HOME=/home/jenkins/tools/java/latest1.8
Setting MAVEN_3_LATEST__HOME=/home/jenkins/tools/maven/latest3/
Adding one-line test results to commit status...
Setting JDK_1_8_LATEST__HOME=/home/jenkins/tools/java/latest1.8
Setting MAVEN_3_LATEST__HOME=/home/jenkins/tools/maven/latest3/
Setting JDK_1_8_LATEST__HOME=/home/jenkins/tools/java/latest1.8
Setting MAVEN_3_LATEST__HOME=/home/jenkins/tools/maven/latest3/
Setting status of 49b23e461ba4dd5c17bec36d4ee2d285ceb78cb4 to FAILURE with url https://builds.apache.org/job/PreCommit-ZOOKEEPER-github-pr-build/2554/
and message: 'FAILURE
 1791 tests run, 2 skipped, 1 failed.'
Using context: Jenkins

Refer to this link for build results (access rights to CI server needed): 
https://builds.apache.org/job/PreCommit-ZOOKEEPER-github-pr-build/2554/

Setting JDK_1_8_LATEST__HOME=/home/jenkins/tools/java/latest1.8
Setting MAVEN_3_LATEST__HOME=/home/jenkins/tools/maven/latest3/
Setting JDK_1_8_LATEST__HOME=/home/jenkins/tools/java/latest1.8
Setting MAVEN_3_LATEST__HOME=/home/jenkins/tools/maven/latest3/
Email was triggered for: Failure - Any
Sending email for trigger: Failure - Any
Setting JDK_1_8_LATEST__HOME=/home/jenkins/tools/java/latest1.8
Setting MAVEN_3_LATEST__HOME=/home/jenkins/tools/maven/latest3/
Setting JDK_1_8_LATEST__HOME=/home/jenkins/tools/java/latest1.8
Setting MAVEN_3_LATEST__HOME=/home/jenkins/tools/maven/latest3/
Setting JDK_1_8_LATEST__HOME=/home/jenkins/tools/java/latest1.8
Setting MAVEN_3_LATEST__HOME=/home/jenkins/tools/maven/latest3/



###################################################################################
############################## FAILED TESTS (if any) ##############################
1 tests failed.
FAILED:  org.apache.zookeeper.server.quorum.Zab1_0Test.testNormalObserverRun

Error Message:
Timeout occurred. Please note the time in the report does not reflect the time until the timeout.

Stack Trace:
junit.framework.AssertionFailedError: Timeout occurred. Please note the time in the report
does not reflect the time until the timeout.
	at java.lang.Thread.run(Thread.java:748)
Mime
  • Unnamed multipart/mixed (inline, None, 0 bytes)
View raw message