zookeeper-dev mailing list archives

Site index · List index
Message view « Date » · « Thread »
Top « Date » · « Thread »
From Apache Jenkins Server <jenk...@builds.apache.org>
Subject Failed: ZOOKEEPER- PreCommit Build #2594
Date Tue, 06 Nov 2018 17:56:56 GMT
Build: https://builds.apache.org/job/PreCommit-ZOOKEEPER-github-pr-build/2594/

###################################################################################
########################## LAST 60 LINES OF THE CONSOLE ###########################
[...truncated 37.83 KB...]
     [exec] 
     [exec] /home/jenkins/jenkins-slave/workspace/PreCommit-ZOOKEEPER-github-pr-build/zookeeper-server/src/test/resources/test-github-pr.sh:
line 469: 32152 Killed                  $ANT_HOME/bin/ant -DZookeeperPatchProcess= -Dtest.junit.output.format=xml
-Dtest.output=yes test-contrib
     [exec] 
     [exec] Error: No value specified for option "issue"
     [exec] Session logged out. Session was JSESSIONID=B362F7475280EA8A042D13B39C5A9F4F.
     [exec] 
     [exec] 
     [exec] ======================================================================
     [exec] ======================================================================
     [exec]     Finished build.
     [exec] ======================================================================
     [exec] ======================================================================
     [exec] 
     [exec] 
     [exec] mv: '/home/jenkins/jenkins-slave/workspace/PreCommit-ZOOKEEPER-github-pr-build/patchprocess'
and '/home/jenkins/jenkins-slave/workspace/PreCommit-ZOOKEEPER-github-pr-build/patchprocess'
are the same file

BUILD FAILED
/home/jenkins/jenkins-slave/workspace/PreCommit-ZOOKEEPER-github-pr-build/build.xml:1839:
exec returned: 2

Total time: 2 minutes 51 seconds
Build step 'Execute shell' marked build as failure
Archiving artifacts
Setting JDK_1_8_LATEST__HOME=/home/jenkins/tools/java/latest1.8
Setting MAVEN_3_LATEST__HOME=/home/jenkins/tools/maven/latest3/
[Fast Archiver] Compressed 832.60 KB of artifacts by 38.4% relative to #2593
Recording test results
Setting JDK_1_8_LATEST__HOME=/home/jenkins/tools/java/latest1.8
Setting MAVEN_3_LATEST__HOME=/home/jenkins/tools/maven/latest3/
ERROR: Step ?Publish JUnit test result report? failed: No test report files were found. Configuration
error?
Setting JDK_1_8_LATEST__HOME=/home/jenkins/tools/java/latest1.8
Setting MAVEN_3_LATEST__HOME=/home/jenkins/tools/maven/latest3/
[description-setter] Description set: ZOOKEEPER-3172
Setting JDK_1_8_LATEST__HOME=/home/jenkins/tools/java/latest1.8
Setting MAVEN_3_LATEST__HOME=/home/jenkins/tools/maven/latest3/
Setting JDK_1_8_LATEST__HOME=/home/jenkins/tools/java/latest1.8
Setting MAVEN_3_LATEST__HOME=/home/jenkins/tools/maven/latest3/
Setting JDK_1_8_LATEST__HOME=/home/jenkins/tools/java/latest1.8
Setting MAVEN_3_LATEST__HOME=/home/jenkins/tools/maven/latest3/
Setting JDK_1_8_LATEST__HOME=/home/jenkins/tools/java/latest1.8
Setting MAVEN_3_LATEST__HOME=/home/jenkins/tools/maven/latest3/
Setting status of 514d48a26aeeca37290ad14ff8f0cdae69b53eb2 to FAILURE with url https://builds.apache.org/job/PreCommit-ZOOKEEPER-github-pr-build/2594/
and message: 'FAILURE
 '
Using context: Jenkins

Refer to this link for build results (access rights to CI server needed): 
https://builds.apache.org/job/PreCommit-ZOOKEEPER-github-pr-build/2594/

Setting JDK_1_8_LATEST__HOME=/home/jenkins/tools/java/latest1.8
Setting MAVEN_3_LATEST__HOME=/home/jenkins/tools/maven/latest3/
Setting JDK_1_8_LATEST__HOME=/home/jenkins/tools/java/latest1.8
Setting MAVEN_3_LATEST__HOME=/home/jenkins/tools/maven/latest3/
Email was triggered for: Failure - Any
Sending email for trigger: Failure - Any
Setting JDK_1_8_LATEST__HOME=/home/jenkins/tools/java/latest1.8
Setting MAVEN_3_LATEST__HOME=/home/jenkins/tools/maven/latest3/
Setting JDK_1_8_LATEST__HOME=/home/jenkins/tools/java/latest1.8
Setting MAVEN_3_LATEST__HOME=/home/jenkins/tools/maven/latest3/
Setting JDK_1_8_LATEST__HOME=/home/jenkins/tools/java/latest1.8
Setting MAVEN_3_LATEST__HOME=/home/jenkins/tools/maven/latest3/



###################################################################################
############################## FAILED TESTS (if any) ##############################
No tests ran.
Mime
  • Unnamed multipart/mixed (inline, None, 0 bytes)
View raw message