zookeeper-dev mailing list archives

Site index · List index
Message view « Date » · « Thread »
Top « Date » · « Thread »
From Apache Jenkins Server <jenk...@builds.apache.org>
Subject Failed: ZOOKEEPER- PreCommit Build #2538
Date Tue, 30 Oct 2018 01:19:27 GMT
Build: https://builds.apache.org/job/PreCommit-ZOOKEEPER-github-pr-build/2538/

###################################################################################
########################## LAST 60 LINES OF THE CONSOLE ###########################
[...truncated 38.06 KB...]
     [exec] 
     [exec] 
     [exec] 
     [exec] Error: No value specified for option "issue"
     [exec] Session logged out.
     [exec] 
     [exec] 
     [exec] ======================================================================
     [exec] ======================================================================
     [exec]     Finished build.
     [exec] ======================================================================
     [exec] ======================================================================
     [exec] 
     [exec] 
     [exec] mv: '/home/jenkins/jenkins-slave/workspace/PreCommit-ZOOKEEPER-github-pr-build@2/patchprocess'
and '/home/jenkins/jenkins-slave/workspace/PreCommit-ZOOKEEPER-github-pr-build@2/patchprocess'
are the same file

BUILD FAILED
/home/jenkins/jenkins-slave/workspace/PreCommit-ZOOKEEPER-github-pr-build@2/build.xml:1859:
exec returned: 2

Total time: 2 minutes 54 seconds
Build step 'Execute shell' marked build as failure
Archiving artifacts
Setting JDK_1_8_LATEST__HOME=/home/jenkins/tools/java/latest1.8
Setting MAVEN_3_LATEST__HOME=/home/jenkins/tools/maven/latest3/
Recording test results
Setting JDK_1_8_LATEST__HOME=/home/jenkins/tools/java/latest1.8
Setting MAVEN_3_LATEST__HOME=/home/jenkins/tools/maven/latest3/
ERROR: Step ?Publish JUnit test result report? failed: No test report files were found. Configuration
error?
Setting JDK_1_8_LATEST__HOME=/home/jenkins/tools/java/latest1.8
Setting MAVEN_3_LATEST__HOME=/home/jenkins/tools/maven/latest3/
[description-setter] Description set: ZOOKEEPER-3174
Setting JDK_1_8_LATEST__HOME=/home/jenkins/tools/java/latest1.8
Setting MAVEN_3_LATEST__HOME=/home/jenkins/tools/maven/latest3/
Setting JDK_1_8_LATEST__HOME=/home/jenkins/tools/java/latest1.8
Setting MAVEN_3_LATEST__HOME=/home/jenkins/tools/maven/latest3/
Adding one-line test results to commit status...
Setting JDK_1_8_LATEST__HOME=/home/jenkins/tools/java/latest1.8
Setting MAVEN_3_LATEST__HOME=/home/jenkins/tools/maven/latest3/
Setting JDK_1_8_LATEST__HOME=/home/jenkins/tools/java/latest1.8
Setting MAVEN_3_LATEST__HOME=/home/jenkins/tools/maven/latest3/
Setting status of 213af717364132bb1e7811d47e20fde527ee6dd3 to FAILURE with url https://builds.apache.org/job/PreCommit-ZOOKEEPER-github-pr-build/2538/
and message: 'FAILURE
 No test results found.'
Using context: Jenkins

Refer to this link for build results (access rights to CI server needed): 
https://builds.apache.org/job/PreCommit-ZOOKEEPER-github-pr-build/2538/

Setting JDK_1_8_LATEST__HOME=/home/jenkins/tools/java/latest1.8
Setting MAVEN_3_LATEST__HOME=/home/jenkins/tools/maven/latest3/
Setting JDK_1_8_LATEST__HOME=/home/jenkins/tools/java/latest1.8
Setting MAVEN_3_LATEST__HOME=/home/jenkins/tools/maven/latest3/
Email was triggered for: Failure - Any
Sending email for trigger: Failure - Any
Setting JDK_1_8_LATEST__HOME=/home/jenkins/tools/java/latest1.8
Setting MAVEN_3_LATEST__HOME=/home/jenkins/tools/maven/latest3/
Setting JDK_1_8_LATEST__HOME=/home/jenkins/tools/java/latest1.8
Setting MAVEN_3_LATEST__HOME=/home/jenkins/tools/maven/latest3/
Setting JDK_1_8_LATEST__HOME=/home/jenkins/tools/java/latest1.8
Setting MAVEN_3_LATEST__HOME=/home/jenkins/tools/maven/latest3/



###################################################################################
############################## FAILED TESTS (if any) ##############################
No tests ran.
Mime
  • Unnamed multipart/mixed (inline, None, 0 bytes)
View raw message