zookeeper-dev mailing list archives

Site index · List index
Message view « Date » · « Thread »
Top « Date » · « Thread »
From Apache Jenkins Server <jenk...@builds.apache.org>
Subject ZooKeeper-trunk - Build # 226 - Still Failing
Date Wed, 10 Oct 2018 23:47:27 GMT
See https://builds.apache.org/job/ZooKeeper-trunk/226/

###################################################################################
########################## LAST 60 LINES OF THE CONSOLE ###########################
[...truncated 195.72 KB...]
    [junit] Running org.apache.zookeeper.server.quorum.auth.MiniKdcTest in thread 3
    [junit] Tests run: 3, Failures: 0, Errors: 0, Skipped: 0, Time elapsed: 1.695 sec, Thread:
3, Class: org.apache.zookeeper.server.quorum.auth.MiniKdcTest
    [junit] Running org.apache.zookeeper.server.quorum.auth.QuorumAuthUpgradeTest in thread
3
    [junit] Tests run: 3, Failures: 0, Errors: 0, Skipped: 0, Time elapsed: 46.146 sec, Thread:
8, Class: org.apache.zookeeper.server.quorum.ReconfigLegacyTest
    [junit] Running org.apache.zookeeper.server.quorum.auth.QuorumDigestAuthTest in thread
8
    [junit] Tests run: 30, Failures: 0, Errors: 0, Skipped: 0, Time elapsed: 95.443 sec, Thread:
2, Class: org.apache.zookeeper.server.quorum.QuorumRequestPipelineTest
    [junit] Running org.apache.zookeeper.server.quorum.auth.QuorumKerberosAuthTest in thread
2
    [junit] Tests run: 5, Failures: 0, Errors: 0, Skipped: 0, Time elapsed: 65.025 sec, Thread:
4, Class: org.apache.zookeeper.server.quorum.ReconfigFailureCasesTest
    [junit] Tests run: 1, Failures: 0, Errors: 0, Skipped: 0, Time elapsed: 6.54 sec, Thread:
2, Class: org.apache.zookeeper.server.quorum.auth.QuorumKerberosAuthTest
    [junit] Running org.apache.zookeeper.server.quorum.auth.QuorumKerberosHostBasedAuthTest
in thread 2
    [junit] Running org.apache.zookeeper.server.util.BitHashSetTest in thread 4
    [junit] Tests run: 2, Failures: 0, Errors: 0, Skipped: 0, Time elapsed: 0.076 sec, Thread:
4, Class: org.apache.zookeeper.server.util.BitHashSetTest
    [junit] Running org.apache.zookeeper.server.util.BitMapTest in thread 4
    [junit] Tests run: 2, Failures: 0, Errors: 0, Skipped: 0, Time elapsed: 0.073 sec, Thread:
4, Class: org.apache.zookeeper.server.util.BitMapTest
    [junit] Running org.apache.zookeeper.server.util.ConfigUtilsTest in thread 4
    [junit] Tests run: 5, Failures: 0, Errors: 0, Skipped: 0, Time elapsed: 0.112 sec, Thread:
4, Class: org.apache.zookeeper.server.util.ConfigUtilsTest
    [junit] Running org.apache.zookeeper.server.util.SerializeUtilsTest in thread 4
    [junit] Tests run: 4, Failures: 0, Errors: 0, Skipped: 0, Time elapsed: 0.357 sec, Thread:
4, Class: org.apache.zookeeper.server.util.SerializeUtilsTest
    [junit] Running org.apache.zookeeper.server.util.VerifyingFileFactoryTest in thread 4
    [junit] Tests run: 4, Failures: 0, Errors: 0, Skipped: 0, Time elapsed: 0.134 sec, Thread:
4, Class: org.apache.zookeeper.server.util.VerifyingFileFactoryTest
    [junit] Running org.apache.zookeeper.server.watch.WatchManagerTest in thread 4
    [junit] Tests run: 5, Failures: 0, Errors: 0, Skipped: 0, Time elapsed: 19.622 sec, Thread:
8, Class: org.apache.zookeeper.server.quorum.auth.QuorumDigestAuthTest
    [junit] Running org.apache.zookeeper.server.watch.WatcherCleanerTest in thread 8
    [junit] Tests run: 12, Failures: 0, Errors: 0, Skipped: 0, Time elapsed: 35.456 sec, Thread:
1, Class: org.apache.zookeeper.server.quorum.Zab1_0Test
    [junit] Running org.apache.zookeeper.server.watch.WatcherOrBitSetTest in thread 1
    [junit] Tests run: 2, Failures: 0, Errors: 0, Skipped: 0, Time elapsed: 0.07 sec, Thread:
1, Class: org.apache.zookeeper.server.watch.WatcherOrBitSetTest
    [junit] Running org.apache.zookeeper.server.watch.WatchesPathReportTest in thread 1
    [junit] Tests run: 3, Failures: 0, Errors: 0, Skipped: 0, Time elapsed: 0.096 sec, Thread:
1, Class: org.apache.zookeeper.server.watch.WatchesPathReportTest
    [junit] Running org.apache.zookeeper.server.watch.WatchesReportTest in thread 1
    [junit] Tests run: 3, Failures: 0, Errors: 0, Skipped: 0, Time elapsed: 0.103 sec, Thread:
1, Class: org.apache.zookeeper.server.watch.WatchesReportTest
    [junit] Running org.apache.zookeeper.server.watch.WatchesSummaryTest in thread 1
    [junit] Tests run: 2, Failures: 0, Errors: 0, Skipped: 0, Time elapsed: 0.111 sec, Thread:
1, Class: org.apache.zookeeper.server.watch.WatchesSummaryTest
    [junit] Running org.apache.zookeeper.client.ZKClientConfigTest in thread 1
    [junit] Tests run: 6, Failures: 0, Errors: 0, Skipped: 0, Time elapsed: 6.387 sec, Thread:
4, Class: org.apache.zookeeper.server.watch.WatchManagerTest
    [junit] Tests run: 3, Failures: 0, Errors: 0, Skipped: 0, Time elapsed: 5.122 sec, Thread:
8, Class: org.apache.zookeeper.server.watch.WatcherCleanerTest
    [junit] Tests run: 5, Failures: 0, Errors: 0, Skipped: 0, Time elapsed: 0.217 sec, Thread:
1, Class: org.apache.zookeeper.client.ZKClientConfigTest
    [junit] Tests run: 5, Failures: 0, Errors: 0, Skipped: 0, Time elapsed: 34.159 sec, Thread:
3, Class: org.apache.zookeeper.server.quorum.auth.QuorumAuthUpgradeTest
    [junit] Running org.apache.jute.BinaryInputArchiveTest in thread 4
    [junit] Tests run: 1, Failures: 0, Errors: 0, Skipped: 0, Time elapsed: 0.071 sec, Thread:
4, Class: org.apache.jute.BinaryInputArchiveTest
    [junit] Tests run: 2, Failures: 0, Errors: 0, Skipped: 0, Time elapsed: 21.143 sec, Thread:
2, Class: org.apache.zookeeper.server.quorum.auth.QuorumKerberosHostBasedAuthTest
    [junit] Tests run: 2, Failures: 0, Errors: 0, Skipped: 0, Time elapsed: 92.266 sec, Thread:
5, Class: org.apache.zookeeper.server.quorum.StandaloneDisabledTest
    [junit] Tests run: 24, Failures: 0, Errors: 0, Skipped: 0, Time elapsed: 248.379 sec,
Thread: 7, Class: org.apache.zookeeper.server.quorum.QuorumPeerMainTest
    [junit] Tests run: 6, Failures: 0, Errors: 0, Skipped: 0, Time elapsed: 200.588 sec, Thread:
6, Class: org.apache.zookeeper.server.quorum.ReconfigRecoveryTest

fail.build.on.test.failure:

BUILD FAILED
/home/jenkins/jenkins-slave/workspace/ZooKeeper-trunk/build.xml:1550: The following error
occurred while executing this line:
/home/jenkins/jenkins-slave/workspace/ZooKeeper-trunk/build.xml:1397: The following error
occurred while executing this line:
/home/jenkins/jenkins-slave/workspace/ZooKeeper-trunk/build.xml:1401: Tests failed!

Total time: 13 minutes 32 seconds
Build step 'Execute shell' marked build as failure
[FINDBUGS] Skipping publisher since build result is FAILURE
[WARNINGS] Skipping publisher since build result is FAILURE
Archiving artifacts
Recording test results
Email was triggered for: Failure - Any
Sending email for trigger: Failure - Any



###################################################################################
############################## FAILED TESTS (if any) ##############################
1 tests failed.
FAILED:  org.apache.zookeeper.test.WatchEventWhenAutoResetTest.testNodeDataChanged

Error Message:
expected:<NodeDataChanged> but was:<NodeDeleted>

Stack Trace:
junit.framework.AssertionFailedError: expected:<NodeDataChanged> but was:<NodeDeleted>
	at org.apache.zookeeper.test.WatchEventWhenAutoResetTest$EventsWatcher.assertEvent(WatchEventWhenAutoResetTest.java:67)
	at org.apache.zookeeper.test.WatchEventWhenAutoResetTest.testNodeDataChanged(WatchEventWhenAutoResetTest.java:117)
	at org.apache.zookeeper.JUnit4ZKTestRunner$LoggedInvokeMethod.evaluate(JUnit4ZKTestRunner.java:79)
Mime
  • Unnamed multipart/mixed (inline, None, 0 bytes)
View raw message