zookeeper-dev mailing list archives

Site index · List index
Message view « Date » · « Thread »
Top « Date » · « Thread »
From Apache Jenkins Server <jenk...@builds.apache.org>
Subject ZooKeeper-trunk - Build # 219 - Still Failing
Date Fri, 05 Oct 2018 15:46:34 GMT
See https://builds.apache.org/job/ZooKeeper-trunk/219/

###################################################################################
########################## LAST 60 LINES OF THE CONSOLE ###########################
[...truncated 332.04 KB...]
     [exec] Log Message Received: [2018-10-05 15:43:50,795:2855(0x2ab897adef40):ZOO_INFO@log_env@1084:
Client environment:host.name=asf904.gq1.ygridcore.net]
     [exec] Log Message Received: [2018-10-05 15:43:50,795:2855(0x2ab897adef40):ZOO_INFO@log_env@1091:
Client environment:os.name=Linux]
     [exec] Log Message Received: [2018-10-05 15:43:50,795:2855(0x2ab897adef40):ZOO_INFO@log_env@1092:
Client environment:os.arch=3.13.0-153-generic]
     [exec] Log Message Received: [2018-10-05 15:43:50,795:2855(0x2ab897adef40):ZOO_INFO@log_env@1093:
Client environment:os.version=#203-Ubuntu SMP Thu Jun 14 08:52:28 UTC 2018]
     [exec] Log Message Received: [2018-10-05 15:43:50,795:2855(0x2ab897adef40):ZOO_INFO@log_env@1101:
Client environment:user.name=jenkins]
     [exec] Log Message Received: [2018-10-05 15:43:50,795:2855(0x2ab897adef40):ZOO_INFO@log_env@1109:
Client environment:user.home=/home/jenkins]
     [exec] Log Message Received: [2018-10-05 15:43:50,795:2855(0x2ab897adef40):ZOO_INFO@log_env@1121:
Client environment:user.dir=/home/jenkins/jenkins-slave/workspace/ZooKeeper-trunk/build/test/test-cppunit]
     [exec] Log Message Received: [2018-10-05 15:43:50,795:2855(0x2ab897adef40):ZOO_INFO@zookeeper_init_internal@1167:
Initiating client connection, host=127.0.0.1:22181 sessionTimeout=10000 watcher=0x4639e0 sessionId=0
sessionPasswd=<null> context=0x7ffe9a876550 flags=0]
     [exec] Log Message Received: [2018-10-05 15:43:50,796:2855(0x2ab899b41700):ZOO_INFO@check_events@2454:
initiated connection to server 127.0.0.1:22181]
     [exec] Log Message Received: [2018-10-05 15:43:50,798:2855(0x2ab899b41700):ZOO_INFO@check_events@2506:
session establishment complete on server 127.0.0.1:22181, sessionId=0x101c6ef1562000f, negotiated
timeout=10000 ]
     [exec]  : elapsed 1001 : OK
     [exec] Zookeeper_simpleSystem::testAsyncWatcherAutoReset ZooKeeper server started : elapsed
10523 : OK
     [exec] Zookeeper_simpleSystem::testDeserializeString : elapsed 0 : OK
     [exec] Zookeeper_simpleSystem::testFirstServerDown : elapsed 1001 : OK
     [exec] Zookeeper_simpleSystem::testNonexistentHost : elapsed 1033 : OK
     [exec] Zookeeper_simpleSystem::testNullData : elapsed 1018 : OK
     [exec] Zookeeper_simpleSystem::testIPV6 : elapsed 1003 : OK
     [exec] Zookeeper_simpleSystem::testCreate : elapsed 1007 : OK
     [exec] Zookeeper_simpleSystem::testPath : elapsed 1010 : OK
     [exec] Zookeeper_simpleSystem::testPathValidation : elapsed 1025 : OK
     [exec] Zookeeper_simpleSystem::testPing : elapsed 17166 : OK
     [exec] Zookeeper_simpleSystem::testAcl : elapsed 1008 : OK
     [exec] Zookeeper_simpleSystem::testChroot : elapsed 3022 : OK
     [exec] Zookeeper_simpleSystem::testAuth ZooKeeper server started ZooKeeper server started
: elapsed 31386 : OK
     [exec] Zookeeper_simpleSystem::testHangingClient : elapsed 1023 : OK
     [exec] Zookeeper_simpleSystem::testWatcherAutoResetWithGlobal ZooKeeper server started
ZooKeeper server started ZooKeeper server started : elapsed 16618 : OK
     [exec] Zookeeper_simpleSystem::testWatcherAutoResetWithLocal ZooKeeper server started
ZooKeeper server started ZooKeeper server started : elapsed 16440 : OK
     [exec] Zookeeper_simpleSystem::testGetChildren2 : elapsed 1054 : OK
     [exec] Zookeeper_simpleSystem::testLastZxid : elapsed 4514 : OK
     [exec] Zookeeper_simpleSystem::testRemoveWatchers ZooKeeper server started : elapsed
4894 : OK
     [exec] Zookeeper_readOnly::testReadOnly : elapsed 4274 : OK
     [exec] Zookeeper_logClientEnv::testLogClientEnv : elapsed 1 : OK
     [exec] OK (76)
     [exec] FAIL: zktest-mt
     [exec] ==========================================
     [exec] 1 of 2 tests failed
     [exec] Please report to user@zookeeper.apache.org
     [exec] ==========================================
     [exec] make[1]: Leaving directory `/home/jenkins/jenkins-slave/workspace/ZooKeeper-trunk/build/test/test-cppunit'
     [exec] *** Error in `./zktest-mt': free(): invalid pointer: 0x00002ab897aca000 ***
     [exec] /bin/bash: line 5:  2855 Aborted                 ZKROOT=/home/jenkins/jenkins-slave/workspace/ZooKeeper-trunk/zookeeper-client/zookeeper-client-c/../..
CLASSPATH=$CLASSPATH:$CLOVER_HOME/lib/clover.jar ${dir}$tst
     [exec] make[1]: *** [check-TESTS] Error 1
     [exec] make: *** [check-am] Error 2

BUILD FAILED
/home/jenkins/jenkins-slave/workspace/ZooKeeper-trunk/build.xml:1550: The following error
occurred while executing this line:
/home/jenkins/jenkins-slave/workspace/ZooKeeper-trunk/build.xml:1510: The following error
occurred while executing this line:
/home/jenkins/jenkins-slave/workspace/ZooKeeper-trunk/build.xml:1520: exec returned: 2

Total time: 14 minutes 19 seconds
Build step 'Execute shell' marked build as failure
[FINDBUGS] Skipping publisher since build result is FAILURE
[WARNINGS] Skipping publisher since build result is FAILURE
Archiving artifacts
[JIRA] Updating issue ZOOKEEPER-3032
[JIRA] Updating issue ZOOKEEPER-3153
Recording test results
Email was triggered for: Failure - Any
Sending email for trigger: Failure - Any



###################################################################################
############################## FAILED TESTS (if any) ##############################
All tests passed
Mime
  • Unnamed multipart/mixed (inline, None, 0 bytes)
View raw message