zookeeper-dev mailing list archives

Site index · List index
Message view « Date » · « Thread »
Top « Date » · « Thread »
From Apache Jenkins Server <jenk...@builds.apache.org>
Subject Failed: ZOOKEEPER- PreCommit Build #2463
Date Tue, 16 Oct 2018 22:57:00 GMT
Build: https://builds.apache.org/job/PreCommit-ZOOKEEPER-github-pr-build/2463/

###################################################################################
########################## LAST 60 LINES OF THE CONSOLE ###########################
[...truncated 76.25 MB...]
     [exec] ======================================================================
     [exec] 
     [exec] 
     [exec] 
     [exec] Error: No value specified for option "issue"
     [exec] Session logged out. Session was JSESSIONID=6DF11C2D7107FFE4E66CF4C4A6B388F4.
     [exec] 
     [exec] 
     [exec] ======================================================================
     [exec] ======================================================================
     [exec]     Finished build.
     [exec] ======================================================================
     [exec] ======================================================================
     [exec] 
     [exec] 
     [exec] mv: ‘/home/jenkins/jenkins-slave/workspace/PreCommit-ZOOKEEPER-github-pr-build/patchprocess’
and ‘/home/jenkins/jenkins-slave/workspace/PreCommit-ZOOKEEPER-github-pr-build/patchprocess’
are the same file

BUILD FAILED
/home/jenkins/jenkins-slave/workspace/PreCommit-ZOOKEEPER-github-pr-build/build.xml:1960:
exec returned: 2

Total time: 19 minutes 43 seconds
Build step 'Execute shell' marked build as failure
Archiving artifacts
Setting JDK_1_8_LATEST__HOME=/home/jenkins/tools/java/latest1.8
Setting MAVEN_3_LATEST__HOME=/home/jenkins/tools/maven/latest3/
Recording test results
Setting JDK_1_8_LATEST__HOME=/home/jenkins/tools/java/latest1.8
Setting MAVEN_3_LATEST__HOME=/home/jenkins/tools/maven/latest3/
Setting JDK_1_8_LATEST__HOME=/home/jenkins/tools/java/latest1.8
Setting MAVEN_3_LATEST__HOME=/home/jenkins/tools/maven/latest3/
[description-setter] Description set: ZOOKEEPER-3152
Setting JDK_1_8_LATEST__HOME=/home/jenkins/tools/java/latest1.8
Setting MAVEN_3_LATEST__HOME=/home/jenkins/tools/maven/latest3/
Setting JDK_1_8_LATEST__HOME=/home/jenkins/tools/java/latest1.8
Setting MAVEN_3_LATEST__HOME=/home/jenkins/tools/maven/latest3/
Adding one-line test results to commit status...
Setting JDK_1_8_LATEST__HOME=/home/jenkins/tools/java/latest1.8
Setting MAVEN_3_LATEST__HOME=/home/jenkins/tools/maven/latest3/
Setting JDK_1_8_LATEST__HOME=/home/jenkins/tools/java/latest1.8
Setting MAVEN_3_LATEST__HOME=/home/jenkins/tools/maven/latest3/
Setting status of d0a6002e559f4e05e7c017580ca442aa822ff8dc to FAILURE with url https://builds.apache.org/job/PreCommit-ZOOKEEPER-github-pr-build/2463/
and message: 'FAILURE
 1694 tests run, 2 skipped, 5 failed.'
Using context: Jenkins

Refer to this link for build results (access rights to CI server needed): 
https://builds.apache.org/job/PreCommit-ZOOKEEPER-github-pr-build/2463/

Setting JDK_1_8_LATEST__HOME=/home/jenkins/tools/java/latest1.8
Setting MAVEN_3_LATEST__HOME=/home/jenkins/tools/maven/latest3/
Setting JDK_1_8_LATEST__HOME=/home/jenkins/tools/java/latest1.8
Setting MAVEN_3_LATEST__HOME=/home/jenkins/tools/maven/latest3/
Email was triggered for: Failure - Any
Sending email for trigger: Failure - Any
Setting JDK_1_8_LATEST__HOME=/home/jenkins/tools/java/latest1.8
Setting MAVEN_3_LATEST__HOME=/home/jenkins/tools/maven/latest3/
Setting JDK_1_8_LATEST__HOME=/home/jenkins/tools/java/latest1.8
Setting MAVEN_3_LATEST__HOME=/home/jenkins/tools/maven/latest3/
Setting JDK_1_8_LATEST__HOME=/home/jenkins/tools/java/latest1.8
Setting MAVEN_3_LATEST__HOME=/home/jenkins/tools/maven/latest3/



###################################################################################
############################## FAILED TESTS (if any) ##############################
5 tests failed.
FAILED:  org.apache.zookeeper.test.AsyncHammerTest.testHammer

Error Message:
unable to create new native thread

Stack Trace:
java.lang.OutOfMemoryError: unable to create new native thread
	at java.lang.Thread.start0(Native Method)
	at java.lang.Thread.start(Thread.java:717)
	at java.util.concurrent.ThreadPoolExecutor.addWorker(ThreadPoolExecutor.java:957)
	at java.util.concurrent.ThreadPoolExecutor.execute(ThreadPoolExecutor.java:1378)
	at io.netty.util.concurrent.SingleThreadEventExecutor.doStartThread(SingleThreadEventExecutor.java:873)
	at io.netty.util.concurrent.SingleThreadEventExecutor.shutdownGracefully(SingleThreadEventExecutor.java:587)
	at io.netty.util.concurrent.MultithreadEventExecutorGroup.shutdownGracefully(MultithreadEventExecutorGroup.java:163)
	at org.apache.zookeeper.server.NettyServerCnxnFactory.shutdown(NettyServerCnxnFactory.java:422)
	at org.apache.zookeeper.server.quorum.QuorumPeer.shutdownServerCnxnFactory(QuorumPeer.java:1725)
	at org.apache.zookeeper.server.quorum.QuorumPeer.shutdown(QuorumPeer.java:1286)
	at org.apache.zookeeper.test.QuorumBase.shutdown(QuorumBase.java:396)
	at org.apache.zookeeper.test.QuorumBase.shutdownServers(QuorumBase.java:383)
	at org.apache.zookeeper.test.QuorumBase.tearDown(QuorumBase.java:371)
	at org.apache.zookeeper.test.AsyncHammerTest.tearDown(AsyncHammerTest.java:66)
	at org.apache.zookeeper.test.AsyncHammerTest.testHammer(AsyncHammerTest.java:197)
	at org.apache.zookeeper.JUnit4ZKTestRunner$LoggedInvokeMethod.evaluate(JUnit4ZKTestRunner.java:79)


FAILED:  org.apache.zookeeper.test.AsyncHammerTest.testObserversHammer

Error Message:
Error occurred in server thread; nested exception is: 
	java.lang.OutOfMemoryError: unable to create new native thread

Stack Trace:
java.rmi.ServerError: Error occurred in server thread; nested exception is: 
	java.lang.OutOfMemoryError: unable to create new native thread
	at sun.rmi.server.UnicastServerRef.dispatch(UnicastServerRef.java:386)
	at sun.rmi.transport.Transport$1.run(Transport.java:200)
	at sun.rmi.transport.Transport$1.run(Transport.java:197)
	at java.security.AccessController.doPrivileged(Native Method)
	at sun.rmi.transport.Transport.serviceCall(Transport.java:196)
	at sun.rmi.transport.tcp.TCPTransport.handleMessages(TCPTransport.java:573)
	at sun.rmi.transport.tcp.TCPTransport$ConnectionHandler.run0(TCPTransport.java:835)
	at sun.rmi.transport.tcp.TCPTransport$ConnectionHandler.lambda$run$0(TCPTransport.java:688)
	at java.security.AccessController.doPrivileged(Native Method)
	at sun.rmi.transport.tcp.TCPTransport$ConnectionHandler.run(TCPTransport.java:687)
	at java.util.concurrent.ThreadPoolExecutor.runWorker(ThreadPoolExecutor.java:1149)
	at java.util.concurrent.ThreadPoolExecutor$Worker.run(ThreadPoolExecutor.java:624)
	at java.lang.Thread.run(Thread.java:748)
	at sun.rmi.transport.StreamRemoteCall.exceptionReceivedFromServer(StreamRemoteCall.java:283)
	at sun.rmi.transport.StreamRemoteCall.executeCall(StreamRemoteCall.java:260)
	at sun.rmi.server.UnicastRef.invoke(UnicastRef.java:161)
	at javax.management.remote.rmi.RMIServerImpl_Stub.newClient(Unknown Source)
	at javax.management.remote.rmi.RMIConnector.getConnection(RMIConnector.java:2430)
	at javax.management.remote.rmi.RMIConnector.connect(RMIConnector.java:308)
	at javax.management.remote.JMXConnectorFactory.connect(JMXConnectorFactory.java:270)
	at javax.management.remote.JMXConnectorFactory.connect(JMXConnectorFactory.java:229)
	at org.apache.zookeeper.test.JMXEnv.setUp(JMXEnv.java:58)
	at org.apache.zookeeper.test.QuorumBase.setUp(QuorumBase.java:86)
	at org.apache.zookeeper.test.AsyncHammerTest.setUp(AsyncHammerTest.java:52)
	at org.apache.zookeeper.test.AsyncHammerTest.testObserversHammer(AsyncHammerTest.java:202)
	at org.apache.zookeeper.JUnit4ZKTestRunner$LoggedInvokeMethod.evaluate(JUnit4ZKTestRunner.java:79)
Caused by: java.lang.OutOfMemoryError: unable to create new native thread
	at java.lang.Thread.start0(Native Method)
	at java.lang.Thread.start(Thread.java:717)
	at com.sun.jmx.remote.internal.ServerCommunicatorAdmin.<init>(ServerCommunicatorAdmin.java:50)
	at javax.management.remote.rmi.RMIConnectionImpl$RMIServerCommunicatorAdmin.<init>(RMIConnectionImpl.java:1321)
	at javax.management.remote.rmi.RMIConnectionImpl.<init>(RMIConnectionImpl.java:164)
	at javax.management.remote.rmi.RMIJRMPServerImpl.makeClient(RMIJRMPServerImpl.java:207)
	at javax.management.remote.rmi.RMIServerImpl.doNewClient(RMIServerImpl.java:250)
	at javax.management.remote.rmi.RMIServerImpl.newClient(RMIServerImpl.java:199)
	at sun.rmi.server.UnicastServerRef.dispatch(UnicastServerRef.java:357)
	at sun.rmi.transport.Transport$1.run(Transport.java:200)
	at sun.rmi.transport.Transport$1.run(Transport.java:197)
	at java.security.AccessController.doPrivileged(Native Method)
	at sun.rmi.transport.Transport.serviceCall(Transport.java:196)
	at sun.rmi.transport.tcp.TCPTransport.handleMessages(TCPTransport.java:573)
	at sun.rmi.transport.tcp.TCPTransport$ConnectionHandler.run0(TCPTransport.java:835)
	at sun.rmi.transport.tcp.TCPTransport$ConnectionHandler.lambda$run$0(TCPTransport.java:688)
	at java.security.AccessController.doPrivileged(Native Method)
	at sun.rmi.transport.tcp.TCPTransport$ConnectionHandler.run(TCPTransport.java:687)
	at java.util.concurrent.ThreadPoolExecutor.runWorker(ThreadPoolExecutor.java:1149)
	at java.util.concurrent.ThreadPoolExecutor$Worker.run(ThreadPoolExecutor.java:624)
	at java.lang.Thread.run(Thread.java:748)


FAILED:  org.apache.zookeeper.test.NettyNettySuiteTest.testPing

Error Message:
Timeout occurred. Please note the time in the report does not reflect the time until the timeout.

Stack Trace:
junit.framework.AssertionFailedError: Timeout occurred. Please note the time in the report
does not reflect the time until the timeout.
	at java.lang.Thread.run(Thread.java:748)


FAILED:  org.apache.zookeeper.test.AsyncHammerTest.testHammer

Error Message:
unable to create new native thread

Stack Trace:
java.lang.OutOfMemoryError: unable to create new native thread
	at java.lang.Thread.start0(Native Method)
	at java.lang.Thread.start(Thread.java:717)
	at java.util.concurrent.ThreadPoolExecutor.addWorker(ThreadPoolExecutor.java:957)
	at java.util.concurrent.ThreadPoolExecutor.execute(ThreadPoolExecutor.java:1378)
	at io.netty.util.concurrent.SingleThreadEventExecutor.doStartThread(SingleThreadEventExecutor.java:873)
	at io.netty.util.concurrent.SingleThreadEventExecutor.shutdownGracefully(SingleThreadEventExecutor.java:587)
	at io.netty.util.concurrent.MultithreadEventExecutorGroup.shutdownGracefully(MultithreadEventExecutorGroup.java:163)
	at org.apache.zookeeper.server.NettyServerCnxnFactory.shutdown(NettyServerCnxnFactory.java:426)
	at org.apache.zookeeper.server.quorum.QuorumPeer.shutdownServerCnxnFactory(QuorumPeer.java:1725)
	at org.apache.zookeeper.server.quorum.QuorumPeer.shutdown(QuorumPeer.java:1286)
	at org.apache.zookeeper.test.QuorumBase.shutdown(QuorumBase.java:396)
	at org.apache.zookeeper.test.QuorumBase.shutdownServers(QuorumBase.java:386)
	at org.apache.zookeeper.test.QuorumBase.tearDown(QuorumBase.java:371)
	at org.apache.zookeeper.test.AsyncHammerTest.tearDown(AsyncHammerTest.java:66)
	at org.apache.zookeeper.test.AsyncHammerTest.testHammer(AsyncHammerTest.java:197)
	at org.apache.zookeeper.JUnit4ZKTestRunner$LoggedInvokeMethod.evaluate(JUnit4ZKTestRunner.java:79)


FAILED:  org.apache.zookeeper.test.AsyncHammerTest.testObserversHammer

Error Message:
unable to create new native thread

Stack Trace:
java.lang.OutOfMemoryError: unable to create new native thread
	at java.lang.Thread.start0(Native Method)
	at java.lang.Thread.start(Thread.java:717)
	at java.util.concurrent.ThreadPoolExecutor.addWorker(ThreadPoolExecutor.java:957)
	at java.util.concurrent.ThreadPoolExecutor.execute(ThreadPoolExecutor.java:1378)
	at io.netty.util.concurrent.SingleThreadEventExecutor.doStartThread(SingleThreadEventExecutor.java:873)
	at io.netty.util.concurrent.SingleThreadEventExecutor.startThread(SingleThreadEventExecutor.java:862)
	at io.netty.util.concurrent.SingleThreadEventExecutor.execute(SingleThreadEventExecutor.java:767)
	at io.netty.channel.AbstractChannel$AbstractUnsafe.register(AbstractChannel.java:479)
	at io.netty.channel.SingleThreadEventLoop.register(SingleThreadEventLoop.java:80)
	at io.netty.channel.SingleThreadEventLoop.register(SingleThreadEventLoop.java:74)
	at io.netty.channel.MultithreadEventLoopGroup.register(MultithreadEventLoopGroup.java:86)
	at io.netty.bootstrap.AbstractBootstrap.initAndRegister(AbstractBootstrap.java:333)
	at io.netty.bootstrap.AbstractBootstrap.doBind(AbstractBootstrap.java:282)
	at io.netty.bootstrap.AbstractBootstrap.bind(AbstractBootstrap.java:278)
	at org.apache.zookeeper.server.NettyServerCnxnFactory.start(NettyServerCnxnFactory.java:444)
	at org.apache.zookeeper.server.quorum.QuorumPeer.startServerCnxnFactory(QuorumPeer.java:1716)
	at org.apache.zookeeper.server.quorum.QuorumPeer.start(QuorumPeer.java:868)
	at org.apache.zookeeper.test.QuorumBase.startServers(QuorumBase.java:211)
	at org.apache.zookeeper.test.QuorumBase.setUp(QuorumBase.java:121)
	at org.apache.zookeeper.test.AsyncHammerTest.setUp(AsyncHammerTest.java:52)
	at org.apache.zookeeper.test.AsyncHammerTest.testObserversHammer(AsyncHammerTest.java:202)
	at org.apache.zookeeper.JUnit4ZKTestRunner$LoggedInvokeMethod.evaluate(JUnit4ZKTestRunner.java:79)
Mime
  • Unnamed multipart/mixed (inline, None, 0 bytes)
View raw message