zookeeper-dev mailing list archives

Site index · List index
Message view « Date » · « Thread »
Top « Date » · « Thread »
From Apache Jenkins Server <jenk...@builds.apache.org>
Subject ZooKeeper_branch35_jdk8 - Build # 1148 - Still Failing
Date Tue, 09 Oct 2018 12:20:23 GMT
See https://builds.apache.org/job/ZooKeeper_branch35_jdk8/1148/

###################################################################################
########################## LAST 60 LINES OF THE CONSOLE ###########################
[...truncated 108.01 KB...]
    [junit] Tests run: 3, Failures: 0, Errors: 0, Skipped: 0, Time elapsed: 49.969 sec, Thread:
7, Class: org.apache.zookeeper.server.quorum.ReconfigBackupTest
    [junit] Tests run: 5, Failures: 0, Errors: 0, Skipped: 0, Time elapsed: 162.104 sec, Thread:
5, Class: org.apache.zookeeper.server.ZxidRolloverTest
    [junit] Running org.apache.zookeeper.server.quorum.ReconfigLegacyTest in thread 3
    [junit] Running org.apache.zookeeper.server.quorum.ReconfigRecoveryTest in thread 7
    [junit] Running org.apache.zookeeper.server.quorum.ReconfigRollingRestartCompatibilityTest
in thread 5
    [junit] Tests run: 3, Failures: 0, Errors: 0, Skipped: 0, Time elapsed: 45.959 sec, Thread:
5, Class: org.apache.zookeeper.server.quorum.ReconfigRollingRestartCompatibilityTest
    [junit] Running org.apache.zookeeper.server.quorum.RemotePeerBeanTest in thread 5
    [junit] Tests run: 3, Failures: 0, Errors: 0, Skipped: 0, Time elapsed: 62.139 sec, Thread:
3, Class: org.apache.zookeeper.server.quorum.ReconfigLegacyTest
    [junit] Tests run: 2, Failures: 0, Errors: 0, Skipped: 0, Time elapsed: 3.419 sec, Thread:
5, Class: org.apache.zookeeper.server.quorum.RemotePeerBeanTest
    [junit] Tests run: 5, Failures: 0, Errors: 0, Skipped: 0, Time elapsed: 86.173 sec, Thread:
8, Class: org.apache.zookeeper.server.quorum.ReconfigFailureCasesTest
    [junit] Running org.apache.zookeeper.server.quorum.StandaloneDisabledTest in thread 3
    [junit] Running org.apache.zookeeper.server.quorum.StatCommandTest in thread 5
    [junit] Running org.apache.zookeeper.server.quorum.StatResetCommandTest in thread 8
    [junit] Tests run: 2, Failures: 0, Errors: 0, Skipped: 0, Time elapsed: 5.799 sec, Thread:
5, Class: org.apache.zookeeper.server.quorum.StatCommandTest
    [junit] Tests run: 3, Failures: 0, Errors: 0, Skipped: 0, Time elapsed: 7.622 sec, Thread:
8, Class: org.apache.zookeeper.server.quorum.StatResetCommandTest
    [junit] Running org.apache.zookeeper.server.quorum.UnifiedServerSocketTest in thread 5
    [junit] Running org.apache.zookeeper.server.quorum.WatchLeakTest in thread 8
    [junit] Tests run: 2, Failures: 0, Errors: 0, Skipped: 0, Time elapsed: 8.269 sec, Thread:
5, Class: org.apache.zookeeper.server.quorum.UnifiedServerSocketTest
    [junit] Tests run: 30, Failures: 0, Errors: 0, Skipped: 0, Time elapsed: 167.324 sec,
Thread: 4, Class: org.apache.zookeeper.server.quorum.QuorumRequestPipelineTest
    [junit] Tests run: 2, Failures: 0, Errors: 0, Skipped: 0, Time elapsed: 7.501 sec, Thread:
8, Class: org.apache.zookeeper.server.quorum.WatchLeakTest
    [junit] Running org.apache.zookeeper.server.quorum.Zab1_0Test in thread 5
    [junit] Running org.apache.zookeeper.server.quorum.auth.MiniKdcTest in thread 4
    [junit] Running org.apache.zookeeper.server.quorum.auth.QuorumAuthUpgradeTest in thread
8
    [junit] Tests run: 3, Failures: 0, Errors: 0, Skipped: 0, Time elapsed: 11.556 sec, Thread:
4, Class: org.apache.zookeeper.server.quorum.auth.MiniKdcTest
    [junit] Running org.apache.zookeeper.server.quorum.auth.QuorumDigestAuthTest in thread
4
    [junit] Tests run: 12, Failures: 1, Errors: 0, Skipped: 0, Time elapsed: 38.915 sec, Thread:
5, Class: org.apache.zookeeper.server.quorum.Zab1_0Test
    [junit] Test org.apache.zookeeper.server.quorum.Zab1_0Test FAILED
    [junit] Running org.apache.zookeeper.server.quorum.auth.QuorumKerberosAuthTest in thread
5
    [junit] Tests run: 5, Failures: 0, Errors: 0, Skipped: 0, Time elapsed: 25.496 sec, Thread:
4, Class: org.apache.zookeeper.server.quorum.auth.QuorumDigestAuthTest
    [junit] Running org.apache.zookeeper.server.quorum.auth.QuorumKerberosHostBasedAuthTest
in thread 4
    [junit] Tests run: 1, Failures: 0, Errors: 0, Skipped: 0, Time elapsed: 13.423 sec, Thread:
5, Class: org.apache.zookeeper.server.quorum.auth.QuorumKerberosAuthTest
    [junit] Tests run: 5, Failures: 0, Errors: 0, Skipped: 0, Time elapsed: 48.267 sec, Thread:
8, Class: org.apache.zookeeper.server.quorum.auth.QuorumAuthUpgradeTest
    [junit] Running org.apache.zookeeper.server.util.SerializeUtilsTest in thread 5
    [junit] Tests run: 14, Failures: 0, Errors: 0, Skipped: 0, Time elapsed: 234.369 sec,
Thread: 6, Class: org.apache.zookeeper.server.quorum.QuorumPeerMainTest
    [junit] Tests run: 4, Failures: 0, Errors: 0, Skipped: 0, Time elapsed: 3.891 sec, Thread:
5, Class: org.apache.zookeeper.server.util.SerializeUtilsTest
    [junit] Running org.apache.zookeeper.server.util.VerifyingFileFactoryTest in thread 8
    [junit] Tests run: 4, Failures: 0, Errors: 0, Skipped: 0, Time elapsed: 0.905 sec, Thread:
8, Class: org.apache.zookeeper.server.util.VerifyingFileFactoryTest
    [junit] Running org.apache.zookeeper.client.ZKClientConfigTest in thread 6
    [junit] Running org.apache.jute.BinaryInputArchiveTest in thread 5
    [junit] Tests run: 1, Failures: 0, Errors: 0, Skipped: 0, Time elapsed: 0.651 sec, Thread:
5, Class: org.apache.jute.BinaryInputArchiveTest
    [junit] Tests run: 5, Failures: 0, Errors: 0, Skipped: 0, Time elapsed: 2.219 sec, Thread:
6, Class: org.apache.zookeeper.client.ZKClientConfigTest
    [junit] Tests run: 2, Failures: 0, Errors: 0, Skipped: 0, Time elapsed: 106.141 sec, Thread:
3, Class: org.apache.zookeeper.server.quorum.StandaloneDisabledTest
    [junit] Tests run: 512, Failures: 0, Errors: 0, Skipped: 0, Time elapsed: 368.606 sec,
Thread: 2, Class: org.apache.zookeeper.server.ServerIdTest
    [junit] Tests run: 2, Failures: 0, Errors: 0, Skipped: 0, Time elapsed: 34.418 sec, Thread:
4, Class: org.apache.zookeeper.server.quorum.auth.QuorumKerberosHostBasedAuthTest
    [junit] Tests run: 6, Failures: 0, Errors: 0, Skipped: 0, Time elapsed: 225.998 sec, Thread:
7, Class: org.apache.zookeeper.server.quorum.ReconfigRecoveryTest
    [junit] Tests run: 11, Failures: 0, Errors: 0, Skipped: 1, Time elapsed: 544.964 sec,
Thread: 1, Class: org.apache.zookeeper.server.quorum.QuorumSSLTest

fail.build.on.test.failure:

BUILD FAILED
/home/jenkins/jenkins-slave/workspace/ZooKeeper_branch35_jdk8/build.xml:1392: The following
error occurred while executing this line:
/home/jenkins/jenkins-slave/workspace/ZooKeeper_branch35_jdk8/build.xml:1396: Tests failed!

Total time: 30 minutes 10 seconds
Build step 'Invoke Ant' marked build as failure
Archiving artifacts
Recording test results
Email was triggered for: Failure - Any
Sending email for trigger: Failure - Any



###################################################################################
############################## FAILED TESTS (if any) ##############################
5 tests failed.
FAILED:  org.apache.zookeeper.ClientRequestTimeoutTest.testClientRequestTimeout

Error Message:
KeeperErrorCode = ConnectionLoss for /clientHang3

Stack Trace:
org.apache.zookeeper.KeeperException$ConnectionLossException: KeeperErrorCode = ConnectionLoss
for /clientHang3
	at org.apache.zookeeper.KeeperException.create(KeeperException.java:102)
	at org.apache.zookeeper.KeeperException.create(KeeperException.java:54)
	at org.apache.zookeeper.ZooKeeper.create(ZooKeeper.java:1459)
	at org.apache.zookeeper.ClientRequestTimeoutTest.testClientRequestTimeout(ClientRequestTimeoutTest.java:100)
	at org.apache.zookeeper.JUnit4ZKTestRunner$LoggedInvokeMethod.evaluate(JUnit4ZKTestRunner.java:79)
	at java.util.concurrent.FutureTask.run(FutureTask.java:266)
	at java.lang.Thread.run(Thread.java:748)


FAILED:  org.apache.zookeeper.server.quorum.RaceConditionTest.testRaceConditionBetweenLeaderAndAckRequestProcessor

Error Message:
Leader failed to transition to new state. Current state is leading

Stack Trace:
junit.framework.AssertionFailedError: Leader failed to transition to new state. Current state
is leading
	at org.apache.zookeeper.server.quorum.RaceConditionTest.testRaceConditionBetweenLeaderAndAckRequestProcessor(RaceConditionTest.java:85)
	at org.apache.zookeeper.JUnit4ZKTestRunner$LoggedInvokeMethod.evaluate(JUnit4ZKTestRunner.java:79)
	at java.util.concurrent.FutureTask.run(FutureTask.java:266)
	at java.lang.Thread.run(Thread.java:748)


FAILED:  org.apache.zookeeper.server.quorum.Zab1_0Test.testNormalFollowerRunWithDiff

Error Message:
expected:<4294967298> but was:<0>

Stack Trace:
junit.framework.AssertionFailedError: expected:<4294967298> but was:<0>
	at org.apache.zookeeper.server.quorum.Zab1_0Test$5.converseWithFollower(Zab1_0Test.java:803)
	at org.apache.zookeeper.server.quorum.Zab1_0Test.testFollowerConversation(Zab1_0Test.java:450)
	at org.apache.zookeeper.server.quorum.Zab1_0Test.testNormalFollowerRunWithDiff(Zab1_0Test.java:718)
	at org.apache.zookeeper.JUnit4ZKTestRunner$LoggedInvokeMethod.evaluate(JUnit4ZKTestRunner.java:79)


FAILED:  org.apache.zookeeper.test.ClientSSLTest.testClientServerSSL

Error Message:
waiting for server 0 being up

Stack Trace:
junit.framework.AssertionFailedError: waiting for server 0 being up
	at org.apache.zookeeper.test.ClientSSLTest.testClientServerSSL(ClientSSLTest.java:98)
	at org.apache.zookeeper.JUnit4ZKTestRunner$LoggedInvokeMethod.evaluate(JUnit4ZKTestRunner.java:79)


FAILED:  org.apache.zookeeper.test.DisconnectedWatcherTest.testManyChildWatchersAutoReset

Error Message:
test timed out after 840000 milliseconds

Stack Trace:
org.junit.runners.model.TestTimedOutException: test timed out after 840000 milliseconds
	at java.lang.Object.wait(Native Method)
	at java.lang.Object.wait(Object.java:502)
	at org.apache.zookeeper.ClientCnxn.submitRequest(ClientCnxn.java:1524)
	at org.apache.zookeeper.ClientCnxn.submitRequest(ClientCnxn.java:1507)
	at org.apache.zookeeper.ZooKeeper.setData(ZooKeeper.java:2303)
	at org.apache.zookeeper.test.DisconnectedWatcherTest.testManyChildWatchersAutoReset(DisconnectedWatcherTest.java:243)
	at org.apache.zookeeper.JUnit4ZKTestRunner$LoggedInvokeMethod.evaluate(JUnit4ZKTestRunner.java:79)
	at java.util.concurrent.FutureTask.run(FutureTask.java:266)
	at java.lang.Thread.run(Thread.java:748)
Mime
  • Unnamed multipart/mixed (inline, None, 0 bytes)
View raw message