zookeeper-dev mailing list archives

Site index · List index
Message view « Date » · « Thread »
Top « Date » · « Thread »
From Apache Jenkins Server <jenk...@builds.apache.org>
Subject Failed: ZOOKEEPER- PreCommit Build #2342
Date Thu, 04 Oct 2018 14:31:11 GMT
Build: https://builds.apache.org/job/PreCommit-ZOOKEEPER-github-pr-build/2342/

###################################################################################
########################## LAST 60 LINES OF THE CONSOLE ###########################
[...truncated 84.89 MB...]
     [exec] Test results: https://builds.apache.org/job/PreCommit-ZOOKEEPER-github-pr-build/2342//testReport/
     [exec] Findbugs warnings: https://builds.apache.org/job/PreCommit-ZOOKEEPER-github-pr-build/2342//artifact/trunk/build/test/findbugs/newPatchFindbugsWarnings.html
     [exec] Console output: https://builds.apache.org/job/PreCommit-ZOOKEEPER-github-pr-build/2342//console
     [exec] 
     [exec] This message is automatically generated.
     [exec] 
     [exec] 
     [exec] ======================================================================
     [exec] ======================================================================
     [exec]     Adding comment to Jira.
     [exec] ======================================================================
     [exec] ======================================================================
     [exec] 
     [exec] 
     [exec] 
     [exec] Error: No value specified for option "issue"
     [exec] 
     [exec] Client error: Invalid request: java.net.ConnectException: Connection timed out
(Connection timed out)
     [exec] 
     [exec] 
     [exec] ======================================================================
     [exec] ======================================================================
     [exec]     Finished build.
     [exec] ======================================================================
     [exec] ======================================================================
     [exec] 
     [exec] 
     [exec] mv: '/home/jenkins/jenkins-slave/workspace/PreCommit-ZOOKEEPER-github-pr-build/patchprocess'
and '/home/jenkins/jenkins-slave/workspace/PreCommit-ZOOKEEPER-github-pr-build/patchprocess'
are the same file

BUILD FAILED
/home/jenkins/jenkins-slave/workspace/PreCommit-ZOOKEEPER-github-pr-build/build.xml:1850:
exec returned: 1

Total time: 23 minutes 18 seconds
Build step 'Execute shell' marked build as failure
Archiving artifacts
Setting JDK_1_8_LATEST__HOME=/home/jenkins/tools/java/latest1.8
Recording test results
Setting JDK_1_8_LATEST__HOME=/home/jenkins/tools/java/latest1.8
Setting JDK_1_8_LATEST__HOME=/home/jenkins/tools/java/latest1.8
[description-setter] Description set: ZOOKEEPER-3153
Setting JDK_1_8_LATEST__HOME=/home/jenkins/tools/java/latest1.8
Setting JDK_1_8_LATEST__HOME=/home/jenkins/tools/java/latest1.8
Adding one-line test results to commit status...
Setting JDK_1_8_LATEST__HOME=/home/jenkins/tools/java/latest1.8
Setting JDK_1_8_LATEST__HOME=/home/jenkins/tools/java/latest1.8
Setting status of 8c57eeeb6137dc254628927b53ba107a650afc5b to FAILURE with url https://builds.apache.org/job/PreCommit-ZOOKEEPER-github-pr-build/2342/
and message: 'FAILURE
 1751 tests run, 1 skipped, 1 failed.'
Using context: Jenkins

Refer to this link for build results (access rights to CI server needed): 
https://builds.apache.org/job/PreCommit-ZOOKEEPER-github-pr-build/2342/

Setting JDK_1_8_LATEST__HOME=/home/jenkins/tools/java/latest1.8
Setting JDK_1_8_LATEST__HOME=/home/jenkins/tools/java/latest1.8
Email was triggered for: Failure - Any
Sending email for trigger: Failure - Any
Setting JDK_1_8_LATEST__HOME=/home/jenkins/tools/java/latest1.8
Setting JDK_1_8_LATEST__HOME=/home/jenkins/tools/java/latest1.8
Setting JDK_1_8_LATEST__HOME=/home/jenkins/tools/java/latest1.8



###################################################################################
############################## FAILED TESTS (if any) ##############################
1 tests failed.
FAILED:  org.apache.zookeeper.test.WatchEventWhenAutoResetTest.testNodeDataChanged

Error Message:
expected:<NodeDataChanged> but was:<NodeDeleted>

Stack Trace:
junit.framework.AssertionFailedError: expected:<NodeDataChanged> but was:<NodeDeleted>
	at org.apache.zookeeper.test.WatchEventWhenAutoResetTest$EventsWatcher.assertEvent(WatchEventWhenAutoResetTest.java:67)
	at org.apache.zookeeper.test.WatchEventWhenAutoResetTest.testNodeDataChanged(WatchEventWhenAutoResetTest.java:126)
	at org.apache.zookeeper.JUnit4ZKTestRunner$LoggedInvokeMethod.evaluate(JUnit4ZKTestRunner.java:79)
Mime
  • Unnamed multipart/mixed (inline, None, 0 bytes)
View raw message