zookeeper-dev mailing list archives

Site index · List index
Message view « Date » · « Thread »
Top « Date » · « Thread »
From Apache Jenkins Server <jenk...@builds.apache.org>
Subject Failed: ZOOKEEPER- PreCommit Build #2305
Date Tue, 02 Oct 2018 06:41:25 GMT
Build: https://builds.apache.org/job/PreCommit-ZOOKEEPER-github-pr-build/2305/

###################################################################################
########################## LAST 60 LINES OF THE CONSOLE ###########################
[...truncated 69.62 MB...]
     [exec] 
     [exec] Test results: https://builds.apache.org/job/PreCommit-ZOOKEEPER-github-pr-build/2305//testReport/
     [exec] Findbugs warnings: https://builds.apache.org/job/PreCommit-ZOOKEEPER-github-pr-build/2305//artifact/trunk/build/test/findbugs/newPatchFindbugsWarnings.html
     [exec] Console output: https://builds.apache.org/job/PreCommit-ZOOKEEPER-github-pr-build/2305//console
     [exec] 
     [exec] This message is automatically generated.
     [exec] 
     [exec] 
     [exec] ======================================================================
     [exec] ======================================================================
     [exec]     Adding comment to Jira.
     [exec] ======================================================================
     [exec] ======================================================================
     [exec] 
     [exec] 
     [exec] 
     [exec] Error: No value specified for option "issue"
     [exec] Session logged out. Session was JSESSIONID=42F086AC3DD2537760905301854B0DB4.
     [exec] 
     [exec] 
     [exec] ======================================================================
     [exec] ======================================================================
     [exec]     Finished build.
     [exec] ======================================================================
     [exec] ======================================================================
     [exec] 
     [exec] 
     [exec] mv: '/home/jenkins/jenkins-slave/workspace/PreCommit-ZOOKEEPER-github-pr-build/patchprocess'
and '/home/jenkins/jenkins-slave/workspace/PreCommit-ZOOKEEPER-github-pr-build/patchprocess'
are the same file

BUILD FAILED
/home/jenkins/jenkins-slave/workspace/PreCommit-ZOOKEEPER-github-pr-build/build.xml:1850:
exec returned: 2

Total time: 8 minutes 48 seconds
Build step 'Execute shell' marked build as failure
Archiving artifacts
Setting JDK_1_8_LATEST__HOME=/home/jenkins/tools/java/latest1.8
Recording test results
Setting JDK_1_8_LATEST__HOME=/home/jenkins/tools/java/latest1.8
Setting JDK_1_8_LATEST__HOME=/home/jenkins/tools/java/latest1.8
[description-setter] Description set: ZOOKEEPER-3108
Setting JDK_1_8_LATEST__HOME=/home/jenkins/tools/java/latest1.8
Setting JDK_1_8_LATEST__HOME=/home/jenkins/tools/java/latest1.8
Adding one-line test results to commit status...
Setting JDK_1_8_LATEST__HOME=/home/jenkins/tools/java/latest1.8
Setting JDK_1_8_LATEST__HOME=/home/jenkins/tools/java/latest1.8
Setting status of 705477b8148397f09171a704fc1a70a75fa2540d to FAILURE with url https://builds.apache.org/job/PreCommit-ZOOKEEPER-github-pr-build/2305/
and message: 'FAILURE
 1511 tests run, 1 skipped, 1 failed.'
Using context: Jenkins

Refer to this link for build results (access rights to CI server needed): 
https://builds.apache.org/job/PreCommit-ZOOKEEPER-github-pr-build/2305/

Setting JDK_1_8_LATEST__HOME=/home/jenkins/tools/java/latest1.8
Setting JDK_1_8_LATEST__HOME=/home/jenkins/tools/java/latest1.8
Email was triggered for: Failure - Any
Sending email for trigger: Failure - Any
Setting JDK_1_8_LATEST__HOME=/home/jenkins/tools/java/latest1.8
Setting JDK_1_8_LATEST__HOME=/home/jenkins/tools/java/latest1.8
Setting JDK_1_8_LATEST__HOME=/home/jenkins/tools/java/latest1.8



###################################################################################
############################## FAILED TESTS (if any) ##############################
1 tests failed.
FAILED:  org.apache.zookeeper.test.WatchEventWhenAutoResetTest.testNodeDataChanged

Error Message:
expected:<NodeDataChanged> but was:<NodeDeleted>

Stack Trace:
junit.framework.AssertionFailedError: expected:<NodeDataChanged> but was:<NodeDeleted>
	at org.apache.zookeeper.test.WatchEventWhenAutoResetTest$EventsWatcher.assertEvent(WatchEventWhenAutoResetTest.java:67)
	at org.apache.zookeeper.test.WatchEventWhenAutoResetTest.testNodeDataChanged(WatchEventWhenAutoResetTest.java:117)
	at org.apache.zookeeper.JUnit4ZKTestRunner$LoggedInvokeMethod.evaluate(JUnit4ZKTestRunner.java:79)
Mime
  • Unnamed multipart/mixed (inline, None, 0 bytes)
View raw message